program: Orca
programVersion: 5.0.2
elementType: Si F O O C C C C C C C C C C C C C C C C C C C C C C C C C H H H H H H H H H H H H H H H H H H H H H H H H H H H H H
charge: 0
multiplicity: 1
keywords: wb97x-d3
keywords: def2-TZVPP
keywords: def2/J RIJCOSX
keywords: DEFGRID2
keywords: scfconv7
keywords: smallprint printgap noloewdin
keywords: NOSOSCF
formula: C25H29FO2Si
InChI: InChI=1/C25H29FO2Si/c1-4-27-21-13-15-23(16-14-21)29(2,3)18-8-9-20-12-17-24(26)25(19-20)28-22-10-6-5-7-11-22/h5-7,10-17,19H,4,8-9,18H2,1-3H3
58 atoms
Si -4.172588 0.950675 0.637696
F  1.978812 -1.456078 1.353818
O  1.685418 1.829168 1.844694
O  1.682033 -0.160116 -1.032054
C  -4.219297 -0.79893 -0.074254
C  -3.590971 -0.920769 -1.470809
C  -2.366777 1.331074 1.007072
C  -5.152654 0.998011 2.244372
C  -4.857226 2.19876 -0.592057
C  -2.717005 -2.169573 -1.651223
C  -1.592845 2.196533 0.237781
C  -1.71859 0.681478 2.066288
C  -1.438333 -2.064946 -0.867158
C  -0.240421 2.410569 0.488401
C  -0.378161 0.875386 2.334295
C  0.37983 1.733756 1.534734
C  -0.422042 -1.226046 -1.324717
C  -1.250521 -2.728992 0.340069
C  0.731712 -1.034863 -0.588663
C  -0.096117 -2.542916 1.092765
C  0.874093 -1.683822 0.630407
C  2.532468 2.652802 1.055788
C  3.957382 2.386776 1.473392
C  2.896916 -0.626675 -1.448974
C  3.84086 0.342883 -1.772111
C  3.202727 -1.975194 -1.579617
C  5.097197 -0.042181 -2.209749
C  4.469192 -2.343583 -2.016939
C  5.422592 -1.387518 -2.330709
H  -3.686592 -1.431543 0.645236
H  -5.243223 -1.184094 -0.087601
H  -2.974225 -0.048034 -1.713818
H  -4.382187 -0.930884 -2.223753
H  -5.088964 1.974435 2.729009
H  -6.210449 0.787841 2.069529
H  -4.792807 0.255383 2.9600
H  -4.808257 3.218824 -0.205313
H  -4.321473 2.183326 -1.543343
H  -5.906349 1.987532 -0.81183
H  -3.275058 -3.058543 -1.347237
H  -2.483153 -2.291305 -2.712106
H  -2.041621 2.736013 -0.589003
H  -2.267345 -0.005077 2.702602
H  0.306586 3.096114 -0.145062
H  0.09902 0.353761 3.155464
H  -0.52884 -0.700852 -2.267326
H  -2.01642 -3.398624 0.711235
H  0.036715 -3.04687 2.041663
H  2.274628 3.707623 1.201962
H  2.404656 2.42977 -0.007163
H  4.632214 2.997068 0.872727
H  4.124556 2.638058 2.521551
H  4.228117 1.34109 1.320043
H  3.588517 1.392326 -1.684611
H  2.474711 -2.745228 -1.359302
H  5.826253 0.718586 -2.457454
H  4.704549 -3.395988 -2.111287
H  6.406858 -1.685013 -2.6673
elementType: Si F O C H
totalener: -1510.06930196 hartree
nucrepener: 3037.61201091 hartree
electener: -4547.68131287 hartree
oneelecener: -8106.75555728 hartree
twoeener: 3559.07424441 hartree
cpcmener: -0.02528060 hartree
kineticenergy: 1503.91261730 hartree
xcener: -135.232869083610 hartree
chargesum: -0.0000000
charge: 0.473937 -0.222657 -0.323257 -0.323175 -0.274623 -0.124397 -0.145926 -0.441777 -0.427632 -0.099158 -0.151475 -0.129075 0.076179 -0.223411 -0.283864 0.342867 -0.249911 -0.193472 0.161993 -0.155648 0.248721 0.041592 -0.280444 0.356274 -0.325384 -0.209039 -0.105781 -0.159370 -0.195314 0.077477 0.095950 0.065892 0.094607 0.102910 0.102596 0.098541 0.109026 0.099502 0.108610 0.088551 0.095473 0.140648 0.132632 0.135039 0.130765 0.129058 0.143866 0.143743 0.114701 0.072387 0.093336 0.097950 0.085187 0.167065 0.148242 0.155791 0.157929 0.155752
qa: 0.4739 -0.2227 -0.3233 -0.3232 -0.2746 -0.1244 -0.1459 -0.4418 -0.4276 -0.0992 -0.1515 -0.1291 0.0762 -0.2234 -0.2839 0.3429 -0.2499 -0.1935 0.1620 -0.1556 0.2487 0.0416 -0.2804 0.3563 -0.3254 -0.2090 -0.1058 -0.1594 -0.1953 0.0775 0.0960 0.0659 0.0946 0.1029 0.1026 0.0985 0.1090 0.0995 0.1086 0.0886 0.0955 0.1406 0.1326 0.1350 0.1308 0.1291 0.1439 0.1437 0.1147 0.0724 0.0933 0.0980 0.0852 0.1671 0.1482 0.1558 0.1579 0.1558
va: 4.1457 1.0527 2.0582 2.0229 3.8250 3.8725 3.6997 3.9047 3.9090 3.8541 3.8705 3.8460 3.5603 3.8485 3.9869 3.6921 4.0173 3.8834 3.5901 3.9053 3.9056 3.7990 3.9648 3.6719 3.9672 3.9077 3.8954 3.9154 3.9202 1.0171 1.0111 1.0058 1.0077 1.0092 1.0104 1.0116 1.0074 1.0094 1.0087 1.0069 1.0064 0.9877 0.9933 1.0107 1.0170 1.0193 1.0006 1.0023 0.9929 0.9899 1.0058 1.0054 1.0029 0.9898 1.0067 0.9912 0.9909 0.9910
dispcorr: -0.035977090 hartree
energy: -1510.105279052247
dipole: -19.01396 18.49035 -0.52361 9.44663 -9.70481 -0.25818 -3.15239 2.21718 -0.93521
magnitude: 1.10247 au
magnitude: 2.80226 debye
