program: Orca
programVersion: 5.0.2
elementType: Si F O O C C C C C C C C C C C C C C C C C C C C C C C C C H H H H H H H H H H H H H H H H H H H H H H H H H H H H H
charge: 0
multiplicity: 1
keywords: wb97x-d3
keywords: def2-TZVPP
keywords: def2/J RIJCOSX
keywords: DEFGRID2
keywords: scfconv7
keywords: smallprint printgap noloewdin
keywords: NOSOSCF
formula: C25H29FO2Si
InChI: InChI=1/C25H29FO2Si/c1-4-27-21-13-15-23(16-14-21)29(2,3)18-8-9-20-12-17-24(26)25(19-20)28-22-10-6-5-7-11-22/h5-7,10-17,19H,4,8-9,18H2,1-3H3
58 atoms
Si -3.057661 1.351531 0.909823
F  1.721088 -4.489476 -0.039946
O  1.881752 2.805335 -2.272521
O  2.000366 -1.842665 -0.437828
C  -3.201088 -0.527857 1.129274
C  -3.772711 -1.324708 -0.044603
C  -1.524884 1.84836 -0.062065
C  -2.927549 2.110554 2.630108
C  -4.587119 2.005968 0.028384
C  -2.848009 -1.445858 -1.260488
C  -1.559254 2.144265 -1.429151
C  -0.278184 1.910992 0.558253
C  -1.610815 -2.251031 -0.972807
C  -0.415719 2.465176 -2.13794
C  0.885861 2.229587 -0.130567
C  0.823948 2.504597 -1.495169
C  -0.364253 -1.648952 -0.837326
C  -1.701086 -3.633361 -0.809661
C  0.758557 -2.405073 -0.529185
C  -0.586999 -4.398519 -0.505336
C  0.633592 -3.772178 -0.353626
C  3.192263 2.833544 -1.719426
C  3.501438 4.121728 -0.987364
C  2.314317 -1.079112 0.649675
C  3.506878 -0.368453 0.567391
C  1.522442 -0.995677 1.787331
C  3.894002 0.444363 1.620047
C  1.92451 -0.173881 2.833297
C  3.102415 0.554012 2.75725
H  -2.229928 -0.933953 1.434206
H  -3.853457 -0.6761 1.997806
H  -4.714158 -0.874659 -0.372124
H  -4.032133 -2.334203 0.29071
H  -3.838503 1.935045 3.207034
H  -2.100389 1.685421 3.202981
H  -2.771764 3.190484 2.585409
H  -5.495377 1.750281 0.579202
H  -4.558555 3.094379 -0.059214
H  -4.7003 1.602829 -0.980188
H  -3.404888 -1.924584 -2.070296
H  -2.568117 -0.455218 -1.625346
H  -2.500727 2.124212 -1.967131
H  -0.188596 1.707722 1.619586
H  -0.47245 2.687402 -3.19706
H  1.819209 2.260102 0.415259
H  -0.256393 -0.57825 -0.974065
H  -2.658665 -4.126405 -0.926671
H  -0.664196 -5.471222 -0.381845
H  3.859177 2.726659 -2.575525
H  3.35882 1.963739 -1.077465
H  4.537926 4.100227 -0.64748
H  3.385535 4.985222 -1.64352
H  2.871004 4.272202 -0.111073
H  4.120913 -0.450603 -0.320888
H  0.596521 -1.549952 1.870727
H  4.820002 1.000282 1.546039
H  1.300396 -0.106349 3.715328
H  3.404712 1.194117 3.575533
elementType: Si F O C H
totalener: -1510.06756535 hartree
nucrepener: 3020.87215632 hartree
electener: -4530.93972168 hartree
oneelecener: -8071.83729334 hartree
twoeener: 3540.89757166 hartree
cpcmener: -0.02208302 hartree
kineticenergy: 1503.90372816 hartree
xcener: -135.234741798902 hartree
chargesum: -0.0000000
charge: 0.471910 -0.216906 -0.335806 -0.328450 -0.262100 -0.154566 -0.143197 -0.457078 -0.437576 -0.102026 -0.098173 -0.196682 -0.034248 -0.273986 -0.264603 0.376512 -0.133471 -0.154968 0.159145 -0.210462 0.250912 0.075067 -0.271016 0.349475 -0.259398 -0.203984 -0.134273 -0.193073 -0.164806 0.072615 0.098757 0.087059 0.092754 0.104304 0.100597 0.103568 0.111556 0.113961 0.100027 0.102284 0.090174 0.142653 0.147332 0.130847 0.135479 0.112362 0.142895 0.146478 0.108268 0.061521 0.092585 0.093154 0.091730 0.144788 0.149827 0.155016 0.158972 0.156259
qa: 0.4719 -0.2169 -0.3358 -0.3284 -0.2621 -0.1546 -0.1432 -0.4571 -0.4376 -0.1020 -0.0982 -0.1967 -0.0342 -0.2740 -0.2646 0.3765 -0.1335 -0.1550 0.1591 -0.2105 0.2509 0.0751 -0.2710 0.3495 -0.2594 -0.2040 -0.1343 -0.1931 -0.1648 0.0726 0.0988 0.0871 0.0928 0.1043 0.1006 0.1036 0.1116 0.1140 0.1000 0.1023 0.0902 0.1427 0.1473 0.1308 0.1355 0.1124 0.1429 0.1465 0.1083 0.0615 0.0926 0.0932 0.0917 0.1448 0.1498 0.1550 0.1590 0.1563
va: 4.1308 1.0713 2.0886 2.0875 3.8274 3.8939 3.6761 3.9107 3.9067 3.8084 3.8279 3.8688 3.6700 4.0507 3.8413 3.7270 3.8658 3.8704 3.7089 3.9239 4.0205 3.8471 3.9181 3.5990 3.9139 3.8166 3.8533 3.8823 3.8680 1.0207 1.0059 1.0011 1.0018 1.0103 1.0108 1.0100 1.0063 1.0084 1.0062 1.0079 1.0139 0.9851 0.9796 1.0154 1.0079 1.0151 0.9995 0.9996 0.9958 1.0094 1.0091 1.0063 1.0010 1.0093 1.0081 0.9900 0.9914 0.9899
dispcorr: -0.036197188 hartree
energy: -1510.103762542502
dipole: -17.25425 16.60137 -0.65288 25.17490 -24.67838 0.49652 6.35538 -5.74698 0.60839
magnitude: 1.02124 au
magnitude: 2.59577 debye
