program: Orca
programVersion: 5.0.2
elementType: Si F O O C C C C C C C C C C C C C C C C C C C C C C C C C H H H H H H H H H H H H H H H H H H H H H H H H H H H H H
charge: 0
multiplicity: 1
keywords: wb97x-d3
keywords: def2-TZVPP
keywords: def2/J RIJCOSX
keywords: DEFGRID2
keywords: scfconv7
keywords: smallprint printgap noloewdin
keywords: NOSOSCF
formula: C25H29FO2Si
InChI: InChI=1/C25H29FO2Si/c1-4-27-21-13-15-23(16-14-21)29(2,3)18-8-9-20-12-17-24(26)25(19-20)28-22-10-6-5-7-11-22/h5-7,10-17,19H,4,8-9,18H2,1-3H3
58 atoms
Si -3.579022 1.018646 1.179812
F  1.887459 -3.706009 -0.86758
O  1.772864 3.035543 -0.795121
O  1.75552 -0.994092 -1.289995
C  -3.688105 -0.872102 1.064717
C  -4.115465 -1.451263 -0.28389
C  -1.917067 1.651601 0.563827
C  -3.743182 1.494204 2.996795
C  -4.964328 1.814166 0.184028
C  -3.129471 -1.219795 -1.429328
C  -0.759235 1.42106 1.30594
C  -1.765518 2.356757 -0.634453
C  -1.78919 -1.879878 -1.239603
C  0.491488 1.863814 0.894428
C  -0.530054 2.801805 -1.070843
C  0.613069 2.559666 -0.306642
C  -0.614044 -1.134518 -1.271526
C  -1.692937 -3.2576 -1.052741
C  0.624646 -1.743719 -1.148122
C  -0.46091 -3.879181 -0.91475
C  0.687094 -3.118138 -0.973083
C  2.946054 2.944574 0.003999
C  4.083072 3.574564 -0.760456
C  2.684098 -0.953599 -0.287845
C  3.975458 -0.60442 -0.662625
C  2.373765 -1.19446 1.043892
C  4.961638 -0.495448 0.305533
C  3.374341 -1.085577 2.000903
C  4.668575 -0.737949 1.641414
H  -2.733257 -1.307158 1.381182
H  -4.411017 -1.190462 1.824416
H  -5.079192 -1.025499 -0.577041
H  -4.292759 -2.52648 -0.181052
H  -3.640802 2.571587 3.142374
H  -4.716449 1.20066 3.397067
H  -2.983777 1.009549 3.614681
H  -5.940566 1.4680 0.531219
H  -4.95484 2.901523 0.286197
H  -4.903482 1.586509 -0.882253
H  -3.578907 -1.601112 -2.351326
H  -2.984086 -0.148749 -1.589824
H  -0.813405 0.881233 2.245711
H  -2.629986 2.570573 -1.253078
H  1.350467 1.661939 1.519642
H  -0.440961 3.347345 -2.002906
H  -0.651029 -0.061309 -1.418061
H  -2.588344 -3.866192 -1.027031
H  -0.38897 -4.95116 -0.78101
H  3.176863 1.898476 0.227622
H  2.791416 3.462286 0.957068
H  3.889703 4.625668 -0.977959
H  4.992789 3.519718 -0.162191
H  4.271807 3.053649 -1.699988
H  4.201518 -0.41612 -1.70493
H  1.366298 -1.451849 1.346891
H  5.966805 -0.223601 0.00963
H  3.131317 -1.272446 3.039136
H  5.441358 -0.656587 2.394401
elementType: Si F O C H
totalener: -1510.07029771 hartree
nucrepener: 3013.42461517 hartree
electener: -4523.49491288 hartree
oneelecener: -8057.41976868 hartree
twoeener: 3533.92485580 hartree
cpcmener: -0.02181032 hartree
kineticenergy: 1503.91393936 hartree
xcener: -135.235286935844 hartree
chargesum: -0.0000000
charge: 0.483089 -0.217987 -0.326420 -0.323679 -0.261503 -0.159460 -0.111197 -0.458998 -0.439164 -0.099160 -0.147337 -0.121601 -0.035155 -0.287030 -0.265526 0.348430 -0.192025 -0.150692 0.131952 -0.199015 0.288611 0.092986 -0.279437 0.332585 -0.277196 -0.199688 -0.107906 -0.154729 -0.181945 0.080390 0.096891 0.088563 0.092411 0.100467 0.102438 0.100246 0.112171 0.114336 0.101130 0.102896 0.083680 0.130473 0.139405 0.136303 0.129212 0.145328 0.139560 0.146263 0.034822 0.112677 0.093247 0.090194 0.087511 0.139063 0.149316 0.155489 0.157363 0.157352
qa: 0.4831 -0.2180 -0.3264 -0.3237 -0.2615 -0.1595 -0.1112 -0.4590 -0.4392 -0.0992 -0.1473 -0.1216 -0.0352 -0.2870 -0.2655 0.3484 -0.1920 -0.1507 0.1320 -0.1990 0.2886 0.0930 -0.2794 0.3326 -0.2772 -0.1997 -0.1079 -0.1547 -0.1819 0.0804 0.0969 0.0886 0.0924 0.1005 0.1024 0.1002 0.1122 0.1143 0.1011 0.1029 0.0837 0.1305 0.1394 0.1363 0.1292 0.1453 0.1396 0.1463 0.0348 0.1127 0.0932 0.0902 0.0875 0.1391 0.1493 0.1555 0.1574 0.1574
va: 4.0962 1.0669 2.0794 2.0496 3.8340 3.8998 3.6402 3.9061 3.9091 3.8002 3.8803 3.8323 3.6868 3.8745 4.0122 3.7204 3.8657 3.8691 3.7879 3.9490 3.9340 3.7848 3.9680 3.5170 3.9475 3.8369 3.8525 3.9076 3.8877 1.0162 1.0054 1.0008 1.0021 1.0106 1.0107 1.0113 1.0076 1.0088 1.0070 1.0048 1.0132 0.9983 0.9892 1.0085 1.0156 0.9999 1.0026 1.0007 0.9925 0.9943 1.0056 1.0061 1.0039 1.0128 1.0068 0.9896 0.9906 0.9896
dispcorr: -0.035564653 hartree
energy: -1510.105862361324
dipole: -17.73106 17.21083 -0.52023 18.03045 -18.08225 -0.05180 9.93290 -9.09106 0.84184
magnitude: 0.99097 au
magnitude: 2.51883 debye
