program: Orca
programVersion: 5.0.2
elementType: Si F O O C C C C C C C C C C C C C C C C C C C C C C C C C H H H H H H H H H H H H H H H H H H H H H H H H H H H H H
charge: 0
multiplicity: 1
keywords: wb97x-d3
keywords: def2-TZVPP
keywords: def2/J RIJCOSX
keywords: DEFGRID2
keywords: scfconv7
keywords: smallprint printgap noloewdin
keywords: NOSOSCF
formula: C25H29FO2Si
InChI: InChI=1/C25H29FO2Si/c1-4-27-21-13-15-23(16-14-21)29(2,3)18-8-9-20-12-17-24(26)25(19-20)28-22-10-6-5-7-11-22/h5-7,10-17,19H,4,8-9,18H2,1-3H3
58 atoms
Si -4.104339 1.389701 1.010162
F  2.041226 -3.781044 -1.971827
O  1.572807 3.26246 0.056288
O  1.843592 -1.066729 -1.791163
C  -4.030968 -0.406894 1.631339
C  -2.836847 -1.230973 1.15087
C  -2.349465 2.008967 0.729337
C  -4.936806 2.440088 2.333782
C  -5.092872 1.537658 -0.585782
C  -2.80825 -1.442355 -0.363504
C  -1.445213 2.09331 1.788514
C  -1.864831 2.354611 -0.535813
C  -1.530307 -2.087818 -0.816612
C  -0.127231 2.496392 1.616375
C  -0.556355 2.760579 -0.733775
C  0.327953 2.83731 0.343404
C  -0.411942 -1.296356 -1.073569
C  -1.410475 -3.467803 -0.939225
C  0.786202 -1.865077 -1.464282
C  -0.209503 -4.052845 -1.322272
C  0.874051 -3.245355 -1.587436
C  2.571568 3.297378 1.069073
C  3.149032 1.931334 1.369591
C  2.982815 -1.1117 -1.036586
C  3.026508 -1.627976 0.251634
C  4.121933 -0.57154 -1.621492
C  4.227801 -1.602989 0.949079
C  5.311212 -0.551809 -0.910708
C  5.373026 -1.069816 0.377061
H  -4.020882 -0.376311 2.726265
H  -4.96797 -0.910155 1.36574
H  -2.83468 -2.210348 1.64034
H  -1.908407 -0.741073 1.457904
H  -5.934492 2.062097 2.570025
H  -4.366305 2.449217 3.265145
H  -5.049881 3.477126 2.010297
H  -4.678376 0.95103 -1.407647
H  -6.116058 1.187329 -0.429111
H  -5.158979 2.574692 -0.922662
H  -3.665865 -2.050022 -0.663896
H  -2.91533 -0.482397 -0.875004
H  -1.761083 1.834003 2.793924
H  -2.517295 2.307338 -1.400461
H  0.521272 2.5367 2.481161
H  -0.209009 3.02293 -1.726182
H  -0.47278 -0.216869 -0.982629
H  -2.265553 -4.102602 -0.74176
H  -0.120664 -5.126934 -1.424843
H  2.191195 3.780277 1.974262
H  3.349716 3.947824 0.66902
H  3.959281 2.032942 2.09296
H  2.41422 1.246171 1.792338
H  3.562486 1.478068 0.468196
H  2.142605 -2.037176 0.724833
H  4.072357 -0.171958 -2.626871
H  4.259593 -2.005033 1.953688
H  6.196227 -0.131846 -1.371414
H  6.303819 -1.055896 0.928487
elementType: Si F O C H
totalener: -1510.06814772 hartree
nucrepener: 2939.52328377 hartree
electener: -4449.59143149 hartree
oneelecener: -7909.53912415 hartree
twoeener: 3459.94769266 hartree
cpcmener: -0.02270306 hartree
kineticenergy: 1503.91343215 hartree
xcener: -135.232472615546 hartree
chargesum: -0.0000000
charge: 0.473933 -0.217433 -0.334131 -0.322419 -0.281225 -0.125356 -0.111472 -0.452481 -0.430074 -0.081849 -0.205981 -0.123307 -0.010315 -0.214328 -0.249103 0.318103 -0.147354 -0.160314 0.102967 -0.188897 0.267687 0.048389 -0.258759 0.305157 -0.204972 -0.247689 -0.147486 -0.109728 -0.196010 0.098413 0.085190 0.093702 0.079207 0.101085 0.099389 0.099918 0.104402 0.108453 0.108124 0.096925 0.074408 0.136102 0.141608 0.138270 0.129959 0.103647 0.141294 0.147239 0.090601 0.107319 0.099599 0.094755 0.065884 0.149602 0.142156 0.157001 0.154520 0.155680
qa: 0.4739 -0.2174 -0.3341 -0.3224 -0.2812 -0.1254 -0.1115 -0.4525 -0.4301 -0.0818 -0.2060 -0.1233 -0.0103 -0.2143 -0.2491 0.3181 -0.1474 -0.1603 0.1030 -0.1889 0.2677 0.0484 -0.2588 0.3052 -0.2050 -0.2477 -0.1475 -0.1097 -0.1960 0.0984 0.0852 0.0937 0.0792 0.1011 0.0994 0.0999 0.1044 0.1085 0.1081 0.0969 0.0744 0.1361 0.1416 0.1383 0.1300 0.1036 0.1413 0.1472 0.0906 0.1073 0.0996 0.0948 0.0659 0.1496 0.1422 0.1570 0.1545 0.1557
va: 4.0925 1.0684 2.0736 2.0730 3.8537 3.8545 3.6939 3.9007 3.8967 3.7555 3.9165 3.8109 3.6744 3.8522 3.9974 3.7561 3.8811 3.8918 3.8305 3.9323 3.9601 3.8831 3.8943 3.6187 3.8529 3.9770 3.8737 3.8703 3.8942 1.0084 1.0134 1.0096 1.0098 1.0102 1.0122 1.0114 1.0094 1.0112 1.0072 1.0118 1.0215 0.9944 0.9891 1.0064 1.0160 1.0434 1.0017 0.9996 0.9971 0.9923 1.0094 0.9958 1.0127 1.0055 1.0109 0.9915 0.9902 0.9917
dispcorr: -0.032967242 hartree
energy: -1510.101114962981
dipole: -20.08819 19.62449 -0.46370 16.34236 -16.43168 -0.08932 17.90686 -16.50478 1.40207
magnitude: 1.47946 au
magnitude: 3.76049 debye
