program: Orca
programVersion: 5.0.2
elementType: Si F O O C C C C C C C C C C C C C C C C C C C C C C C C C H H H H H H H H H H H H H H H H H H H H H H H H H H H H H
charge: 0
multiplicity: 1
keywords: wb97x-d3
keywords: def2-TZVPP
keywords: def2/J RIJCOSX
keywords: DEFGRID2
keywords: scfconv7
keywords: smallprint printgap noloewdin
keywords: NOSOSCF
formula: C25H29FO2Si
InChI: InChI=1/C25H29FO2Si/c1-4-27-21-13-15-23(16-14-21)29(2,3)18-8-9-20-12-17-24(26)25(19-20)28-22-10-6-5-7-11-22/h5-7,10-17,19H,4,8-9,18H2,1-3H3
58 atoms
Si -3.750252 1.200142 0.662614
F  1.280393 -3.942365 1.357768
O  2.064167 2.62699 1.562882
O  1.880172 -1.597411 0.267036
C  -3.663122 -0.401676 -0.334861
C  -2.905762 -0.265041 -1.656617
C  -1.96882 1.722389 0.984142
C  -4.627391 0.860283 2.293851
C  -4.638556 2.556244 -0.292363
C  -2.3823 -1.595833 -2.208007
C  -1.468033 2.96771 0.612404
C  -1.057813 0.827292 1.560277
C  -1.395395 -2.254046 -1.281387
C  -0.133169 3.319162 0.786564
C  0.273059 1.152294 1.744492
C  0.752445 2.403442 1.348317
C  -0.187383 -1.624148 -0.986404
C  -1.68129 -3.465916 -0.660239
C  0.714835 -2.196579 -0.104044
C  -0.789139 -4.045088 0.233173
C  0.401878 -3.406813 0.498445
C  2.664187 3.840776 1.125901
C  2.925651 3.873331 -0.364777
C  2.766689 -1.149587 -0.670238
C  3.653831 -0.166917 -0.248913
C  2.83695 -1.660078 -1.960501
C  4.616355 0.305638 -1.127363
C  3.798984 -1.166209 -2.831414
C  4.69078 -0.184431 -2.424556
H  -3.169517 -1.139173 0.309106
H  -4.667741 -0.799573 -0.511985
H  -2.057221 0.417793 -1.545969
H  -3.55539 0.193929 -2.406515
H  -5.650252 0.511002 2.134131
H  -4.110048 0.091389 2.872402
H  -4.68153 1.755011 2.917676
H  -4.706028 3.483243 0.281123
H  -4.145661 2.790397 -1.238171
H  -5.66106 2.252521 -0.528855
H  -3.219103 -2.275096 -2.387448
H  -1.911157 -1.417165 -3.178942
H  -2.124014 3.703976 0.161782
H  -1.386211 -0.157299 1.876636
H  0.189713 4.302929 0.473353
H  0.953396 0.440256 2.195633
H  0.054188 -0.671074 -1.443686
H  -2.617934 -3.968024 -0.868406
H  -1.018022 -4.986525 0.71626
H  3.609255 3.892558 1.666961
H  2.070126 4.702921 1.44441
H  2.011394 3.835121 -0.957142
H  3.443813 4.799332 -0.618045
H  3.561844 3.041814 -0.669979
H  3.593087 0.217957 0.761245
H  2.160233 -2.435708 -2.29503
H  5.31047 1.065874 -0.792717
H  3.848861 -1.562607 -3.837453
H  5.438193 0.193231 -3.109638
elementType: Si F O C H
totalener: -1510.06848542 hartree
nucrepener: 2963.09399298 hartree
electener: -4473.16247839 hartree
oneelecener: -7957.03169761 hartree
twoeener: 3483.86921922 hartree
cpcmener: -0.02317387 hartree
kineticenergy: 1503.90613779 hartree
xcener: -135.232220466023 hartree
chargesum: 0.0000000
charge: 0.484420 -0.217256 -0.335658 -0.328258 -0.266850 -0.127018 -0.190496 -0.421349 -0.446445 -0.096172 -0.118664 -0.101456 0.002334 -0.256809 -0.304248 0.365211 -0.205519 -0.177227 0.203876 -0.166878 0.183193 0.036927 -0.261262 0.338887 -0.282652 -0.211582 -0.122245 -0.150591 -0.189576 0.076397 0.092031 0.074515 0.091203 0.101212 0.100234 0.101718 0.106423 0.105057 0.109013 0.080882 0.099768 0.140950 0.129490 0.137417 0.135114 0.149146 0.139927 0.148102 0.108979 0.091905 0.092671 0.098541 0.079969 0.145109 0.152860 0.159783 0.158295 0.156653
qa: 0.4844 -0.2173 -0.3357 -0.3283 -0.2669 -0.1270 -0.1905 -0.4213 -0.4464 -0.0962 -0.1187 -0.1015 0.0023 -0.2568 -0.3042 0.3652 -0.2055 -0.1772 0.2039 -0.1669 0.1832 0.0369 -0.2613 0.3389 -0.2827 -0.2116 -0.1222 -0.1506 -0.1896 0.0764 0.0920 0.0745 0.0912 0.1012 0.1002 0.1017 0.1064 0.1051 0.1090 0.0809 0.0998 0.1409 0.1295 0.1374 0.1351 0.1491 0.1399 0.1481 0.1090 0.0919 0.0927 0.0985 0.0800 0.1451 0.1529 0.1598 0.1583 0.1567
va: 4.1335 1.0702 2.0625 2.0429 3.8447 3.8622 3.7510 3.8960 3.9188 3.8587 3.8588 3.8331 3.6774 3.9246 3.9842 3.7280 3.8760 3.8632 3.5773 3.8806 4.1039 3.8550 3.9084 3.6722 3.9511 3.9150 3.8677 3.9088 3.9156 1.0160 1.0153 1.0067 1.0072 1.0094 1.0094 1.0090 1.0083 1.0059 1.0091 1.0081 1.0036 0.9891 0.9922 1.0047 1.0210 1.0060 1.0028 0.9980 0.9922 0.9975 1.0034 1.0113 1.0095 1.0217 0.9996 0.9867 0.9903 0.9908
dispcorr: -0.033234715 hartree
energy: -1510.101720131591
dipole: -18.33440 17.70423 -0.63017 24.45648 -23.40372 1.05277 -8.89342 7.44467 -1.44875
magnitude: 1.89850 au
magnitude: 4.82560 debye
