program: Orca
programVersion: 5.0.2
elementType: Si F O O C C C C C C C C C C C C C C C C C C C C C C C C C H H H H H H H H H H H H H H H H H H H H H H H H H H H H H
charge: 0
multiplicity: 1
keywords: wb97x-d3
keywords: def2-TZVPP
keywords: def2/J RIJCOSX
keywords: DEFGRID2
keywords: scfconv7
keywords: smallprint printgap noloewdin
keywords: NOSOSCF
formula: C25H29FO2Si
InChI: InChI=1/C25H29FO2Si/c1-4-27-21-13-15-23(16-14-21)29(2,3)18-8-9-20-12-17-24(26)25(19-20)28-22-10-6-5-7-11-22/h5-7,10-17,19H,4,8-9,18H2,1-3H3
58 atoms
Si -2.874154 2.15814 -0.332802
F  2.630232 -4.72202 -0.00364
O  1.079028 3.395322 4.081405
O  1.999982 -3.477875 -2.269365
C  -3.265529 0.305245 -0.298378
C  -2.015675 -0.57013 -0.277628
C  -1.667095 2.578597 1.050464
C  -4.458054 3.145283 -0.101155
C  -2.080336 2.591644 -1.985272
C  -2.306986 -2.072313 -0.351782
C  -0.290109 2.35771 0.913137
C  -2.095984 3.102449 2.268363
C  -1.033184 -2.865183 -0.271828
C  0.601977 2.63599 1.931438
C  -1.21862 3.39412 3.307571
C  0.143415 3.156216 3.143906
C  -0.143539 -2.845608 -1.34366
C  -0.673245 -3.552259 0.882652
C  1.09511 -3.459065 -1.252455
C  0.553158 -4.197418 0.97567
C  1.429729 -4.131357 -0.084506
C  0.679208 3.92545 5.338455
C  1.910695 4.070812 6.197372
C  2.226244 -2.344595 -3.003624
C  2.197995 -1.07065 -2.448165
C  2.540426 -2.525408 -4.343389
C  2.473226 0.02479 -3.254585
C  2.824146 -1.42108 -5.133576
C  2.784557 -0.14145 -4.597264
H  -3.888949 0.083985 0.575074
H  -3.880052 0.065727 -1.174339
H  -1.443615 -0.371787 0.633466
H  -1.35543 -0.303427 -1.109583
H  -4.970532 2.895419 0.830164
H  -4.268956 4.220743 -0.093737
H  -5.159881 2.945302 -0.914223
H  -1.164653 2.025959 -2.171703
H  -2.760059 2.38145 -2.814356
H  -1.821723 3.65142 -2.037208
H  -2.974694 -2.35791 0.464767
H  -2.835458 -2.293009 -1.283656
H  0.107889 1.955939 -0.012364
H  -3.148902 3.303885 2.4322
H  1.661708 2.45298 1.798169
H  -1.614951 3.804599 4.226641
H  -0.41633 -2.327687 -2.256321
H  -1.352646 -3.585087 1.725266
H  0.834335 -4.732371 1.873965
H  -0.043026 3.257377 5.819758
H  0.192169 4.896963 5.20183
H  2.395239 3.10918 6.370184
H  2.63634 4.75035 5.749107
H  1.627879 4.47952 7.167599
H  1.964548 -0.922149 -1.401364
H  2.566766 -3.524305 -4.760728
H  2.443362 1.01701 -2.82279
H  3.070477 -1.566402 -6.177535
H  2.997119 0.718246 -5.218842
elementType: Si F O C H
totalener: -1510.07157363 hartree
nucrepener: 2758.23897458 hartree
electener: -4268.31054820 hartree
oneelecener: -7546.44480209 hartree
twoeener: 3278.13425388 hartree
cpcmener: -0.02416275 hartree
kineticenergy: 1503.90773736 hartree
xcener: -135.227136181704 hartree
chargesum: -0.0000000
charge: 0.488119 -0.217807 -0.325010 -0.330726 -0.245586 -0.134711 -0.161379 -0.464289 -0.412907 -0.059566 -0.109936 -0.132602 0.009540 -0.291809 -0.257855 0.346351 -0.212846 -0.203004 0.196348 -0.163716 0.182547 0.064374 -0.273653 0.298819 -0.201454 -0.249618 -0.147864 -0.119764 -0.186714 0.083351 0.079855 0.085824 0.081171 0.099944 0.105758 0.104642 0.093600 0.105363 0.107114 0.078087 0.090421 0.140065 0.136975 0.131664 0.135611 0.146296 0.140398 0.148175 0.092075 0.092329 0.087297 0.087418 0.088816 0.154766 0.145264 0.159014 0.157358 0.158071
qa: 0.4881 -0.2178 -0.3250 -0.3307 -0.2456 -0.1347 -0.1614 -0.4643 -0.4129 -0.0596 -0.1099 -0.1326 0.0095 -0.2918 -0.2579 0.3464 -0.2128 -0.2030 0.1963 -0.1637 0.1825 0.0644 -0.2737 0.2988 -0.2015 -0.2496 -0.1479 -0.1198 -0.1867 0.0834 0.0799 0.0858 0.0812 0.0999 0.1058 0.1046 0.0936 0.1054 0.1071 0.0781 0.0904 0.1401 0.1370 0.1317 0.1356 0.1463 0.1404 0.1482 0.0921 0.0923 0.0873 0.0874 0.0888 0.1548 0.1453 0.1590 0.1574 0.1581
va: 4.1329 1.0680 2.0827 2.0813 3.8217 3.8849 3.7294 3.9297 3.8819 3.8157 3.8424 3.9117 3.6850 4.0684 3.8964 3.7599 3.9072 3.9066 3.7020 3.8766 4.0597 3.7992 3.9750 3.6887 3.8865 4.0040 3.8811 3.8864 3.9078 1.0158 1.0165 1.0041 1.0015 1.0116 1.0102 1.0111 1.0136 1.0088 1.0072 1.0146 1.0077 0.9836 0.9907 1.0151 1.0138 1.0025 1.0036 0.9982 0.9862 0.9864 1.0035 1.0036 1.0057 0.9973 1.0083 0.9903 0.9889 0.9905
dispcorr: -0.026776750 hartree
energy: -1510.098350376212
dipole: -21.57413 20.14439 -1.42974 32.36462 -31.06954 1.29508 10.17973 -9.47763 0.70210
magnitude: 2.05288 au
magnitude: 5.21802 debye
