program: Orca
programVersion: 5.0.2
elementType: Si F O O C C C C C C C C C C C C C C C C C C C C C C C C C H H H H H H H H H H H H H H H H H H H H H H H H H H H H H
charge: 0
multiplicity: 1
keywords: wb97x-d3
keywords: def2-TZVPP
keywords: def2/J RIJCOSX
keywords: DEFGRID2
keywords: scfconv7
keywords: smallprint printgap noloewdin
keywords: NOSOSCF
formula: C25H29FO2Si
InChI: InChI=1/C25H29FO2Si/c1-4-27-21-13-15-23(16-14-21)29(2,3)18-8-9-20-12-17-24(26)25(19-20)28-22-10-6-5-7-11-22/h5-7,10-17,19H,4,8-9,18H2,1-3H3
58 atoms
Si -3.262072 0.354288 1.824927
F  2.384362 -0.475752 -2.189062
O  0.965925 3.588205 -1.048516
O  1.766483 -2.870794 -1.013617
C  -3.2401 -1.255854 0.835671
C  -3.728041 -1.066679 -0.606389
C  -1.950196 1.443366 1.025998
C  -2.811145 0.030521 3.622981
C  -4.946331 1.184972 1.713869
C  -3.01354 -1.957621 -1.62808
C  -2.254357 2.465494 0.121301
C  -0.596738 1.178772 1.235349
C  -1.566857 -1.578943 -1.794688
C  -1.267344 3.172776 -0.54346
C  0.41255 1.873617 0.582206
C  0.079004 2.876424 -0.326201
C  -0.546641 -2.392717 -1.311262
C  -1.220856 -0.370622 -2.3981
C  0.783734 -2.024778 -1.441704
C  0.105121 0.012361 -2.531816
C  1.094966 -0.822766 -2.059414
C  2.361964 3.393079 -0.855925
C  2.8874 4.078512 0.387366
C  2.632684 -2.438636 -0.045096
C  2.28062 -1.48657 0.901928
C  3.89016 -3.027299 -0.024145
C  3.208637 -1.112235 1.864185
C  4.803407 -2.64821 0.947682
C  4.472136 -1.6848 1.891905
H  -2.201159 -1.60589 0.848628
H  -3.817979 -2.041606 1.331134
H  -3.61012 -0.027893 -0.93383
H  -4.801734 -1.263078 -0.653137
H  -2.761345 0.957318 4.198384
H  -3.552228 -0.612177 4.104028
H  -1.844056 -0.467323 3.721396
H  -5.253933 1.370183 0.682696
H  -5.71625 0.557537 2.169293
H  -4.96111 2.143862 2.23636
H  -3.092396 -3.004717 -1.325652
H  -3.522224 -1.870456 -2.592095
H  -3.287974 2.723939 -0.080495
H  -0.298245 0.400724 1.930633
H  -1.532469 3.956065 -1.24379
H  1.44191 1.611836 0.787723
H  -0.780359 -3.33594 -0.831096
H  -1.994988 0.285745 -2.776463
H  0.370549 0.948479 -3.006765
H  2.827864 3.827245 -1.74089
H  2.609345 2.326791 -0.860817
H  2.468497 3.669521 1.307002
H  3.97013 3.95412 0.43597
H  2.676771 5.148333 0.363028
H  1.294272 -1.040146 0.90291
H  4.150374 -3.771396 -0.766672
H  2.932487 -0.367867 2.600262
H  5.784407 -3.10573 0.958841
H  5.191061 -1.386547 2.643453
elementType: Si F O C H
totalener: -1510.06773831 hartree
nucrepener: 3012.78345794 hartree
electener: -4522.85119625 hartree
oneelecener: -8055.92427564 hartree
twoeener: 3533.07307940 hartree
cpcmener: -0.02333231 hartree
kineticenergy: 1503.90574530 hartree
xcener: -135.231387206285 hartree
chargesum: -0.0000000
charge: 0.472693 -0.221867 -0.336358 -0.330985 -0.256101 -0.123986 -0.128398 -0.441350 -0.428184 -0.096288 -0.101750 -0.178512 0.079268 -0.281013 -0.247671 0.334462 -0.265642 -0.258310 0.218220 -0.152074 0.236232 0.063538 -0.265615 0.235271 -0.138017 -0.211061 -0.189382 -0.142396 -0.161322 0.075214 0.093555 0.064239 0.093433 0.103518 0.102942 0.098767 0.099627 0.108232 0.110238 0.084418 0.098418 0.140408 0.141903 0.129308 0.133139 0.133987 0.143324 0.149559 0.108283 0.069921 0.090386 0.094217 0.089758 0.146247 0.143823 0.156170 0.156476 0.157087
qa: 0.4727 -0.2219 -0.3364 -0.3310 -0.2561 -0.1240 -0.1284 -0.4413 -0.4282 -0.0963 -0.1018 -0.1785 0.0793 -0.2810 -0.2477 0.3345 -0.2656 -0.2583 0.2182 -0.1521 0.2362 0.0635 -0.2656 0.2353 -0.1380 -0.2111 -0.1894 -0.1424 -0.1613 0.0752 0.0936 0.0642 0.0934 0.1035 0.1029 0.0988 0.0996 0.1082 0.1102 0.0844 0.0984 0.1404 0.1419 0.1293 0.1331 0.1340 0.1433 0.1496 0.1083 0.0699 0.0904 0.0942 0.0898 0.1462 0.1438 0.1562 0.1565 0.1571
va: 4.1480 1.0583 2.0599 2.0737 3.8228 3.8947 3.6985 3.9053 3.9089 3.8417 3.8399 3.8617 3.5751 4.0400 3.8217 3.7082 3.9930 3.8929 3.7122 3.8313 3.9480 3.8470 3.9276 3.7452 3.8233 3.9754 3.9268 3.9137 3.8850 1.0156 1.0116 1.0054 1.0080 1.0096 1.0109 1.0117 1.0090 1.0087 1.0075 1.0091 1.0037 0.9869 0.9806 1.0162 1.0036 1.0172 1.0031 0.9968 0.9920 1.0053 1.0018 1.0084 1.0057 0.9969 1.0091 0.9939 0.9892 0.9900
dispcorr: -0.035106504 hartree
energy: -1510.102844815878
dipole: -18.37848 18.01558 -0.36290 10.01787 -9.88901 0.12886 16.31473 -15.81068 0.50405
magnitude: 0.63432 au
magnitude: 1.61232 debye
