program: Orca
programVersion: 5.0.2
elementType: Si F O O C C C C C C C C C C C C C C C C C C C C C C C C C H H H H H H H H H H H H H H H H H H H H H H H H H H H H H
charge: 0
multiplicity: 1
keywords: wb97x-d3
keywords: def2-TZVPP
keywords: def2/J RIJCOSX
keywords: DEFGRID2
keywords: scfconv7
keywords: smallprint printgap noloewdin
keywords: NOSOSCF
formula: C25H29FO2Si
InChI: InChI=1/C25H29FO2Si/c1-4-27-21-13-15-23(16-14-21)29(2,3)18-8-9-20-12-17-24(26)25(19-20)28-22-10-6-5-7-11-22/h5-7,10-17,19H,4,8-9,18H2,1-3H3
58 atoms
Si -3.901086 1.159266 0.661161
F  1.447254 -3.029469 -2.314122
O  1.809363 2.978791 -0.096152
O  1.535146 -0.533294 -1.240041
C  -3.99532 -0.680284 0.199338
C  -3.644796 -1.681081 1.301131
C  -2.151334 1.811207 0.473779
C  -4.47576 1.411378 2.440231
C  -5.029616 2.105336 -0.516289
C  -2.182925 -1.657603 1.754307
C  -1.375112 2.20548 1.55844
C  -1.539127 1.857696 -0.7847
C  -1.207059 -2.027391 0.669134
C  -0.049157 2.60191 1.421047
C  -0.227662 2.252103 -0.94834
C  0.540215 2.618843 0.159419
C  -0.243873 -1.122652 0.235324
C  -1.24537 -3.286122 0.075488
C  0.641853 -1.452493 -0.777023
C  -0.356758 -3.634863 -0.929814
C  0.579338 -2.712944 -1.351386
C  2.68221 3.295936 0.970665
C  3.194935 2.076529 1.714208
C  2.839627 -0.625009 -0.864411
C  3.724621 0.228314 -1.514271
C  3.295504 -1.486439 0.124465
C  5.066091 0.209511 -1.176253
C  4.644643 -1.490853 0.452614
C  5.536991 -0.649655 -0.191059
H  -5.020263 -0.874901 -0.134598
H  -3.366041 -0.858274 -0.679473
H  -3.890845 -2.692616 0.962978
H  -4.277603 -1.504966 2.175814
H  -3.8474 0.884574 3.16112
H  -4.472392 2.468053 2.713664
H  -5.495232 1.045154 2.576477
H  -5.008018 3.176646 -0.312699
H  -4.730209 1.969048 -1.557058
H  -6.065578 1.771839 -0.433087
H  -1.926769 -0.669528 2.144322
H  -2.068084 -2.351018 2.592996
H  -1.796402 2.199427 2.557463
H  -2.094397 1.562358 -1.668535
H  0.501358 2.88837 2.30661
H  0.22829 2.263511 -1.929431
H  -0.179483 -0.137756 0.679905
H  -1.97841 -4.014386 0.400408
H  -0.386984 -4.614061 -1.388996
H  2.21095 4.009342 1.656769
H  3.516752 3.818484 0.502232
H  2.393968 1.495966 2.171025
H  3.747592 1.415252 1.048858
H  3.870307 2.393541 2.510307
H  3.352033 0.90155 -2.27459
H  2.614755 -2.146804 0.645174
H  5.750013 0.873746 -1.688364
H  4.99483 -2.164815 1.223502
H  6.586604 -0.663022 0.068882
totalener: -1510.04709802 hartree
nucrepener: 3024.52777276 hartree
electener: -4534.57487078 hartree
oneelecener: -8078.67962316 hartree
twoeener: 3544.10475238 hartree
kineticenergy: 1503.95886423 hartree
xcener: -135.244645710202 hartree
chargesum: 0.0000000
charge: 0.431645 -0.194638 -0.290292 -0.287430 -0.244593 -0.160067 -0.107499 -0.418517 -0.411010 -0.122021 -0.163708 -0.057514 -0.038973 -0.193113 -0.259574 0.330738 -0.078709 -0.094729 0.069045 -0.197705 0.269172 0.019274 -0.231883 0.302287 -0.236198 -0.151411 -0.084395 -0.132162 -0.151847 0.091073 0.083613 0.086262 0.082866 0.087782 0.108584 0.105160 0.096032 0.089949 0.090518 0.073271 0.100097 0.115257 0.099940 0.103900 0.106869 0.113293 0.110446 0.120164 0.080034 0.100874 0.083728 0.069942 0.089911 0.111743 0.118395 0.121870 0.122657 0.121597
qa: 0.4316 -0.1946 -0.2903 -0.2874 -0.2446 -0.1601 -0.1075 -0.4185 -0.4110 -0.1220 -0.1637 -0.0575 -0.0390 -0.1931 -0.2596 0.3307 -0.0787 -0.0947 0.0690 -0.1977 0.2692 0.0193 -0.2319 0.3023 -0.2362 -0.1514 -0.0844 -0.1322 -0.1518 0.0911 0.0836 0.0863 0.0829 0.0878 0.1086 0.1052 0.0960 0.0899 0.0905 0.0733 0.1001 0.1153 0.0999 0.1039 0.1069 0.1133 0.1104 0.1202 0.0800 0.1009 0.0837 0.0699 0.0899 0.1117 0.1184 0.1219 0.1227 0.1216
va: 4.1552 1.1043 2.1037 2.0975 3.8189 3.9004 3.6962 3.9100 3.9063 3.8232 3.9379 3.8664 3.7136 3.9008 4.0244 3.7809 3.8436 3.8766 3.8072 3.9879 4.0463 3.8800 3.9175 3.7157 3.9876 3.9089 3.8984 3.9705 3.9414 1.0067 1.0180 1.0042 1.0033 1.0097 1.0118 1.0116 1.0130 1.0152 1.0134 1.0190 1.0049 0.9975 1.0019 1.0147 1.0234 0.9948 1.0090 1.0092 0.9987 0.9951 1.0068 1.0077 1.0166 1.0224 1.0179 0.9998 1.0014 1.0019
dispcorr: -0.036193009 hartree
energy: -1510.083291028790
dipole: -17.81519 17.67382 -0.14137 12.60965 -12.60838 0.00127 19.11800 -18.10831 1.00969
magnitude: 1.01954 au
magnitude: 2.59146 debye
