program: Orca
programVersion: 5.0.2
elementType: Si F O O C C C C C C C C C C C C C C C C C C C C C C C C C H H H H H H H H H H H H H H H H H H H H H H H H H H H H H
charge: 0
multiplicity: 1
keywords: wb97x-d3
keywords: def2-TZVPP
keywords: def2/J RIJCOSX
keywords: DEFGRID2
keywords: scfconv7
keywords: smallprint printgap noloewdin
keywords: NOSOSCF
formula: C25H29FO2Si
InChI: InChI=1/C25H29FO2Si/c1-4-27-21-13-15-23(16-14-21)29(2,3)18-8-9-20-12-17-24(26)25(19-20)28-22-10-6-5-7-11-22/h5-7,10-17,19H,4,8-9,18H2,1-3H3
58 atoms
Si -3.375138 1.329264 -0.229234
F  1.772374 -3.985632 -1.159128
O  2.331664 2.295125 1.49847
O  1.924367 -1.601825 0.17713
C  -3.593183 -0.429343 -0.914874
C  -3.966962 -1.505461 0.104863
C  -1.618973 1.637895 0.355481
C  -4.564372 1.606137 1.208813
C  -3.760105 2.543451 -1.620896
C  -2.877404 -1.814717 1.134196
C  -0.562442 1.718575 -0.560284
C  -1.293872 1.790625 1.699071
C  -1.627174 -2.391856 0.527748
C  0.739495 1.941282 -0.162794
C  0.011759 2.002224 2.12835
C  1.039644 2.082018 1.193424
C  -0.415073 -1.714888 0.594594
C  -1.660907 -3.624228 -0.119071
C  0.735133 -2.252358 0.039315
C  -0.521824 -4.168581 -0.688657
C  0.66984 -3.477741 -0.605193
C  2.703865 2.419807 2.853478
C  4.198008 2.63671 2.912705
C  2.409544 -0.860762 -0.856424
C  3.581049 -0.158488 -0.599998
C  1.791704 -0.76228 -2.095613
C  4.130365 0.642551 -1.584361
C  2.358283 0.042048 -3.074501
C  3.523562 0.750605 -2.828977
H  -4.378354 -0.382329 -1.67671
H  -2.685185 -0.722726 -1.452324
H  -4.226442 -2.43061 -0.419776
H  -4.873693 -1.209701 0.639842
H  -4.4994 2.627147 1.587296
H  -5.597336 1.440097 0.899395
H  -4.370762 0.933314 2.045898
H  -3.096761 2.402057 -2.475974
H  -4.78225 2.424425 -1.984131
H  -3.643178 3.576103 -1.290383
H  -2.622659 -0.911739 1.694555
H  -3.278409 -2.52064 1.867471
H  -0.752415 1.602475 -1.621862
H  -2.070749 1.74461 2.453931
H  1.537857 2.004352 -0.891291
H  0.201999 2.109423 3.187404
H  -0.348301 -0.754147 1.09023
H  -2.590579 -4.176565 -0.177698
H  -0.548265 -5.126534 -1.190121
H  2.429297 1.516428 3.41189
H  2.181418 3.263769 3.320734
H  4.736914 1.798583 2.472088
H  4.486786 3.545521 2.386218
H  4.516565 2.732861 3.950199
H  4.04305 -0.233523 0.375022
H  0.868945 -1.286963 -2.303578
H  5.037357 1.1933 -1.372813
H  1.874547 0.112083 -4.040019
H  3.956033 1.377104 -3.59682
totalener: -1510.04884227 hartree
nucrepener: 3028.22600747 hartree
electener: -4538.27484973 hartree
oneelecener: -8086.05533026 hartree
twoeener: 3547.78048052 hartree
kineticenergy: 1503.97612175 hartree
xcener: -135.245598851523 hartree
chargesum: 0.0000000
charge: 0.429329 -0.193817 -0.278964 -0.296040 -0.243798 -0.152978 -0.085820 -0.416875 -0.418590 -0.120694 -0.074686 -0.173220 -0.048856 -0.260709 -0.190111 0.332970 -0.087210 -0.100744 0.090021 -0.194482 0.264600 0.035602 -0.257044 0.359063 -0.233031 -0.200774 -0.060257 -0.125306 -0.174020 0.092378 0.079592 0.086521 0.082351 0.110669 0.103836 0.088178 0.088899 0.091149 0.096654 0.069117 0.100735 0.098069 0.114472 0.134292 0.101201 0.120974 0.110577 0.120311 0.080699 0.081033 0.081368 0.087561 0.080619 0.105232 0.111004 0.116031 0.122591 0.120328
qa: 0.4293 -0.1938 -0.2790 -0.2960 -0.2438 -0.1530 -0.0858 -0.4169 -0.4186 -0.1207 -0.0747 -0.1732 -0.0489 -0.2607 -0.1901 0.3330 -0.0872 -0.1007 0.0900 -0.1945 0.2646 0.0356 -0.2570 0.3591 -0.2330 -0.2008 -0.0603 -0.1253 -0.1740 0.0924 0.0796 0.0865 0.0824 0.1107 0.1038 0.0882 0.0889 0.0911 0.0967 0.0691 0.1007 0.0981 0.1145 0.1343 0.1012 0.1210 0.1106 0.1203 0.0807 0.0810 0.0814 0.0876 0.0806 0.1052 0.1110 0.1160 0.1226 0.1203
va: 4.1416 1.1033 2.1250 2.1155 3.8140 3.8986 3.6956 3.9082 3.9090 3.8252 3.8783 3.9602 3.7195 4.0309 3.9137 3.8403 3.8826 3.8862 3.8191 3.9802 4.0098 3.8529 3.9870 3.6776 3.9967 3.8958 3.9151 3.9430 3.9693 1.0062 1.0210 1.0044 1.0038 1.0122 1.0117 1.0101 1.0158 1.0136 1.0134 1.0210 1.0052 1.0046 0.9976 1.0055 1.0199 0.9840 1.0089 1.0093 0.9851 0.9854 1.0051 1.0052 1.0081 1.0213 1.0219 1.0011 1.0007 1.0028
dispcorr: -0.035727764 hartree
energy: -1510.084570030478
dipole: -19.09119 18.48734 -0.60385 20.96108 -20.55640 0.40468 7.97512 -7.43214 0.54299
magnitude: 0.90732 au
magnitude: 2.30622 debye
