program: Orca
programVersion: 5.0.2
elementType: Si F O O C C C C C C C C C C C C C C C C C C C C C C C C C H H H H H H H H H H H H H H H H H H H H H H H H H H H H H
charge: 0
multiplicity: 1
keywords: wb97x-d3
keywords: def2-TZVPP
keywords: def2/J RIJCOSX
keywords: DEFGRID2
keywords: scfconv7
keywords: smallprint printgap noloewdin
keywords: NOSOSCF
formula: C25H29FO2Si
InChI: InChI=1/C25H29FO2Si/c1-4-27-21-13-15-23(16-14-21)29(2,3)18-8-9-20-12-17-24(26)25(19-20)28-22-10-6-5-7-11-22/h5-7,10-17,19H,4,8-9,18H2,1-3H3
58 atoms
Si -2.632826 1.580933 -0.761588
F  1.584655 -4.61399 -0.834737
O  2.240841 2.487608 2.693575
O  1.97831 -1.953303 -0.620939
C  -2.989398 -0.263787 -1.034493
C  -3.542874 -1.074917 0.139374
C  -1.141638 1.90271 0.333498
C  -4.148593 2.386813 0.022068
C  -2.301301 2.336403 -2.457052
C  -2.529894 -1.402402 1.24443
C  0.160688 1.877072 -0.181762
C  -1.26999 2.155307 1.696624
C  -1.408866 -2.273949 0.752113
C  1.266604 2.075813 0.620638
C  -0.172365 2.35584 2.524349
C  1.110601 2.313118 1.986734
C  -0.204504 -1.713744 0.346525
C  -1.569823 -3.652367 0.634332
C  0.801406 -2.496864 -0.198594
C  -0.560599 -4.450597 0.120215
C  0.615151 -3.864746 -0.307403
C  2.156118 2.696579 4.086623
C  3.561276 2.827312 4.626677
C  1.933979 -1.037875 -1.628307
C  0.922718 -1.007659 -2.581728
C  2.976028 -0.121456 -1.686097
C  0.955926 -0.044374 -3.579544
C  2.996356 0.832902 -2.689415
C  1.983283 0.884712 -3.637144
H  -3.721427 -0.296505 -1.85001
H  -2.094206 -0.746229 -1.441349
H  -3.951023 -2.01911 -0.235462
H  -4.389076 -0.547503 0.589807
H  -4.392012 1.960727 0.996971
H  -4.000919 3.458332 0.163102
H  -5.029446 2.25739 -0.609286
H  -1.444476 1.867783 -2.945189
H  -3.158518 2.213939 -3.121349
H  -2.08911 3.403759 -2.383144
H  -2.120622 -0.483206 1.667786
H  -3.05625 -1.909027 2.057404
H  0.329028 1.688539 -1.236459
H  -2.254594 2.200638 2.148781
H  2.262367 2.043507 0.198626
H  -0.337846 2.545303 3.576171
H  -0.042641 -0.646647 0.443709
H  -2.496105 -4.114483 0.953773
H  -0.684038 -5.522131 0.035859
H  1.64066 1.85762 4.569895
H  1.579472 3.603639 4.305199
H  4.080889 3.671846 4.175439
H  3.530256 2.987943 5.703926
H  4.142105 1.925468 4.437287
H  0.115101 -1.72744 -2.555502
H  3.759101 -0.161379 -0.940195
H  0.167285 -0.027716 -4.320679
H  3.809068 1.546512 -2.725446
H  1.999627 1.634807 -4.415847
totalener: -1510.04862853 hartree
nucrepener: 3000.12809110 hartree
electener: -4510.17671962 hartree
oneelecener: -8029.60847478 hartree
twoeener: 3519.43175516 hartree
kineticenergy: 1503.96190456 hartree
xcener: -135.243249866714 hartree
chargesum: -0.0000000
charge: 0.407797 -0.192907 -0.280248 -0.297979 -0.230031 -0.141536 -0.168113 -0.412013 -0.396140 -0.125875 -0.035488 -0.104451 0.005387 -0.222604 -0.220380 0.325894 -0.139585 -0.132672 0.130637 -0.182262 0.226356 0.043510 -0.258965 0.278723 -0.125113 -0.255846 -0.196226 -0.082459 -0.116628 0.092532 0.058391 0.087297 0.077371 0.081966 0.109056 0.100288 0.082659 0.092821 0.102253 0.083581 0.090552 0.092689 0.119991 0.113014 0.102206 0.124374 0.113545 0.119804 0.079419 0.077590 0.086330 0.078002 0.087605 0.129776 0.131568 0.131415 0.128246 0.124875
qa: 0.4078 -0.1929 -0.2802 -0.2980 -0.2300 -0.1415 -0.1681 -0.4120 -0.3961 -0.1259 -0.0355 -0.1045 0.0054 -0.2226 -0.2204 0.3259 -0.1396 -0.1327 0.1306 -0.1823 0.2264 0.0435 -0.2590 0.2787 -0.1251 -0.2558 -0.1962 -0.0825 -0.1166 0.0925 0.0584 0.0873 0.0774 0.0820 0.1091 0.1003 0.0827 0.0928 0.1023 0.0836 0.0906 0.0927 0.1200 0.1130 0.1022 0.1244 0.1135 0.1198 0.0794 0.0776 0.0863 0.0780 0.0876 0.1298 0.1316 0.1314 0.1282 0.1249
va: 4.2089 1.1050 2.1305 2.1227 3.8074 3.9011 3.7034 3.9229 3.9023 3.8492 3.8282 3.8794 3.7145 4.0134 3.9622 3.8782 3.8381 3.9162 3.7367 3.9460 4.0776 3.8485 3.9847 3.7584 3.8291 3.9668 3.9357 3.9017 3.9004 1.0105 1.0340 1.0018 1.0046 1.0114 1.0105 1.0104 1.0199 1.0139 1.0121 1.0230 1.0100 0.9798 0.9928 1.0256 1.0209 1.0073 1.0070 1.0082 0.9854 0.9845 1.0054 1.0070 1.0057 1.0074 1.0125 1.0009 0.9974 1.0005
dispcorr: -0.035233460 hartree
energy: -1510.083861985790
dipole: -18.05581 17.31355 -0.74226 25.26303 -24.60939 0.65364 8.09087 -7.42429 0.66658
magnitude: 1.19270 au
magnitude: 3.03159 debye
