program: Orca
programVersion: 5.0.2
elementType: Si F O O C C C C C C C C C C C C C C C C C C C C C C C C C H H H H H H H H H H H H H H H H H H H H H H H H H H H H H
charge: 0
multiplicity: 1
keywords: wb97x-d3
keywords: def2-TZVPP
keywords: def2/J RIJCOSX
keywords: DEFGRID2
keywords: scfconv7
keywords: smallprint printgap noloewdin
keywords: NOSOSCF
formula: C25H29FO2Si
InChI: InChI=1/C25H29FO2Si/c1-4-27-21-13-15-23(16-14-21)29(2,3)18-8-9-20-12-17-24(26)25(19-20)28-22-10-6-5-7-11-22/h5-7,10-17,19H,4,8-9,18H2,1-3H3
58 atoms
Si -3.997554 1.684461 0.13543
F  2.125404 -4.158252 -0.263769
O  1.843616 2.443458 1.503211
O  2.042878 -1.617462 0.654635
C  -4.185046 0.296462 -1.159222
C  -3.020551 -0.689605 -1.24266
C  -2.181042 1.937306 0.547478
C  -4.938862 1.251988 1.71223
C  -4.700921 3.271641 -0.600476
C  -2.810174 -1.504251 0.035123
C  -1.677455 1.772664 1.842048
C  -1.257906 2.278773 -0.439284
C  -1.508494 -2.251135 0.001108
C  -0.337871 1.941705 2.136216
C  0.094095 2.447148 -0.17236
C  0.565604 2.286385 1.129619
C  -0.331372 -1.595325 0.355438
C  -1.430053 -3.565293 -0.442325
C  0.8902 -2.237432 0.269142
C  -0.210264 -4.221309 -0.531795
C  0.941106 -3.549895 -0.18038
C  2.810532 2.786379 0.528538
C  4.145195 2.917184 1.221769
C  2.792694 -0.981669 -0.285543
C  4.096452 -0.66659 0.080819
C  2.314528 -0.626151 -1.540456
C  4.918415 0.000729 -0.809793
C  3.152784 0.042952 -2.422292
C  4.453445 0.361641 -2.067641
H  -5.118816 -0.241619 -0.961117
H  -4.325786 0.763625 -2.138997
H  -2.097934 -0.146831 -1.463152
H  -3.165985 -1.38052 -2.078829
H  -4.567437 0.340959 2.183968
H  -4.880456 2.05348 2.450447
H  -5.99635 1.091722 1.495454
H  -4.131735 3.58931 -1.475944
H  -5.738043 3.145224 -0.916529
H  -4.67125 4.091143 0.118568
H  -2.812973 -0.839458 0.902604
H  -3.646267 -2.195011 0.173937
H  -2.345442 1.503376 2.651996
H  -1.588349 2.421408 -1.463223
H  0.027346 1.810404 3.146645
H  0.762063 2.700844 -0.983777
H  -0.360472 -0.569517 0.707033
H  -2.334642 -4.091996 -0.719883
H  -0.149523 -5.246971 -0.870203
H  2.541839 3.732965 0.043771
H  2.860827 2.016807 -0.248944
H  4.913234 3.172057 0.492131
H  4.12505 3.698987 1.980773
H  4.43225 1.979985 1.69629
H  4.455951 -0.95556 1.059498
H  1.300724 -0.860245 -1.836074
H  5.93335 0.236312 -0.518015
H  2.775928 0.314987 -3.399497
H  5.099809 0.878742 -2.763346
totalener: -1510.04993319 hartree
nucrepener: 2987.87662180 hartree
electener: -4497.92655499 hartree
oneelecener: -8005.00881043 hartree
twoeener: 3507.08225544 hartree
kineticenergy: 1503.96288035 hartree
xcener: -135.241121527752 hartree
chargesum: -0.0000000
charge: 0.438415 -0.195300 -0.281402 -0.294605 -0.285723 -0.103492 -0.089334 -0.403406 -0.408706 -0.101225 -0.089569 -0.183704 0.026038 -0.211434 -0.196407 0.312000 -0.136432 -0.122703 0.103541 -0.181952 0.266815 0.057633 -0.275621 0.296046 -0.219286 -0.162322 -0.112329 -0.138673 -0.134954 0.079484 0.095520 0.068721 0.089405 0.094483 0.101467 0.098851 0.088523 0.092346 0.095443 0.067677 0.087506 0.116593 0.110242 0.111728 0.102945 0.059063 0.112371 0.120356 0.101887 0.047882 0.080851 0.097379 0.088034 0.122617 0.125207 0.124378 0.123444 0.123686
qa: 0.4384 -0.1953 -0.2814 -0.2946 -0.2857 -0.1035 -0.0893 -0.4034 -0.4087 -0.1012 -0.0896 -0.1837 0.0260 -0.2114 -0.1964 0.3120 -0.1364 -0.1227 0.1035 -0.1820 0.2668 0.0576 -0.2756 0.2960 -0.2193 -0.1623 -0.1123 -0.1387 -0.1350 0.0795 0.0955 0.0687 0.0894 0.0945 0.1015 0.0989 0.0885 0.0923 0.0954 0.0677 0.0875 0.1166 0.1102 0.1117 0.1029 0.0591 0.1124 0.1204 0.1019 0.0479 0.0809 0.0974 0.0880 0.1226 0.1252 0.1244 0.1234 0.1237
va: 4.1239 1.1035 2.1140 2.1114 3.8599 3.8441 3.7352 3.8991 3.9018 3.7903 3.8373 3.9815 3.7022 4.0277 3.8741 3.8128 3.8660 3.9169 3.8256 3.9585 4.0501 3.8115 3.9770 3.7050 3.9583 3.8564 3.8884 3.9360 3.9040 1.0139 1.0084 1.0171 1.0117 1.0122 1.0097 1.0160 1.0154 1.0122 1.0148 1.0314 1.0130 0.9971 0.9973 1.0207 1.0220 1.0526 1.0089 1.0083 0.9948 0.9855 1.0063 1.0098 1.0071 1.0186 1.0117 1.0005 1.0012 1.0009
dispcorr: -0.035109273 hartree
energy: -1510.085042458444
dipole: -19.39021 19.00124 -0.38896 23.74190 -23.28928 0.45262 -2.69007 2.05037 -0.63969
magnitude: 0.87485 au
magnitude: 2.22370 debye
