program: Orca
programVersion: 5.0.2
elementType: Si F O O C C C C C C C C C C C C C C C C C C C C C C C C C H H H H H H H H H H H H H H H H H H H H H H H H H H H H H
charge: 0
multiplicity: 1
keywords: wb97x-d3
keywords: def2-TZVPP
keywords: def2/J RIJCOSX
keywords: DEFGRID2
keywords: scfconv7
keywords: smallprint printgap noloewdin
keywords: NOSOSCF
formula: C25H29FO2Si
InChI: InChI=1/C25H29FO2Si/c1-4-27-21-13-15-23(16-14-21)29(2,3)18-8-9-20-12-17-24(26)25(19-20)28-22-10-6-5-7-11-22/h5-7,10-17,19H,4,8-9,18H2,1-3H3
58 atoms
Si -3.53614 1.751343 0.465682
F  1.699569 -4.912802 0.738122
O  1.777693 2.634323 -2.263162
O  2.308883 -2.322838 0.389817
C  -4.216534 0.043813 -0.000064
C  -3.232724 -1.10764 0.2424
C  -1.867754 2.059074 -0.33475
C  -3.327202 1.811837 2.339447
C  -4.762584 3.069906 -0.08946
C  -2.328955 -1.39351 -0.961186
C  -1.765522 2.534493 -1.647615
C  -0.672607 1.782741 0.324045
C  -1.234515 -2.355027 -0.596382
C  -0.546491 2.717792 -2.267132
C  0.568678 1.952487 -0.278241
C  0.636737 2.426005 -1.585516
C  0.040837 -1.883165 -0.309738
C  -1.487205 -3.716433 -0.458112
C  1.036545 -2.738833 0.139292
C  -0.498644 -4.58366 -0.022321
C  0.750873 -4.087898 0.290465
C  3.00622 2.304561 -1.647715
C  4.117323 2.615677 -2.62241
C  2.528462 -1.197292 1.12134
C  1.672997 -0.76239 2.127324
C  3.697122 -0.497562 0.84762
C  1.990222 0.382144 2.843082
C  4.004346 0.640623 1.576381
C  3.149312 1.094148 2.570556
H  -5.122671 -0.106943 0.59622
H  -4.55306 0.037084 -1.042046
H  -3.772806 -2.025024 0.494065
H  -2.601159 -0.901737 1.113338
H  -2.873452 2.751582 2.657291
H  -4.290371 1.724377 2.84487
H  -2.697285 1.002981 2.713794
H  -4.915802 3.058191 -1.169827
H  -5.73943 2.917348 0.372602
H  -4.423399 4.070662 0.180783
H  -2.936031 -1.796623 -1.776865
H  -1.894516 -0.462063 -1.328819
H  -2.662413 2.77189 -2.20895
H  -0.683581 1.415815 1.344181
H  -0.49045 3.088425 -3.28262
H  1.459569 1.715303 0.288938
H  0.25815 -0.827764 -0.431137
H  -2.46995 -4.107784 -0.690301
H  -0.692097 -5.642248 0.089132
H  3.023244 1.243956 -1.371997
H  3.139548 2.87753 -0.722182
H  4.012543 2.037794 -3.539967
H  4.13229 3.673453 -2.883004
H  5.079733 2.366036 -2.17591
H  0.768683 -1.310193 2.357099
H  4.360696 -0.85617 0.071382
H  1.322168 0.715524 3.626506
H  4.918398 1.178272 1.359817
H  3.387969 1.985787 3.1338
totalener: -1510.04952123 hartree
nucrepener: 2968.46890582 hartree
electener: -4478.51842705 hartree
oneelecener: -7965.87132620 hartree
twoeener: 3487.35289915 hartree
kineticenergy: 1503.96004330 hartree
xcener: -135.241424639806 hartree
chargesum: 0.0000000
charge: 0.433738 -0.193259 -0.283145 -0.292504 -0.249656 -0.126815 -0.117134 -0.396574 -0.419852 -0.101314 -0.052483 -0.185291 0.002581 -0.240353 -0.157930 0.321410 -0.157582 -0.158106 0.160048 -0.164604 0.196678 0.066042 -0.258017 0.305218 -0.169050 -0.262411 -0.149371 -0.113961 -0.111807 0.084632 0.072411 0.089119 0.071063 0.107253 0.098407 0.080684 0.086352 0.093282 0.101482 0.089413 0.087326 0.101855 0.111798 0.113349 0.064395 0.138616 0.114469 0.119998 0.077277 0.075221 0.087737 0.087676 0.075579 0.130342 0.133844 0.128480 0.127750 0.125694
qa: 0.4337 -0.1933 -0.2831 -0.2925 -0.2497 -0.1268 -0.1171 -0.3966 -0.4199 -0.1013 -0.0525 -0.1853 0.0026 -0.2404 -0.1579 0.3214 -0.1576 -0.1581 0.1600 -0.1646 0.1967 0.0660 -0.2580 0.3052 -0.1690 -0.2624 -0.1494 -0.1140 -0.1118 0.0846 0.0724 0.0891 0.0711 0.1073 0.0984 0.0807 0.0864 0.0933 0.1015 0.0894 0.0873 0.1019 0.1118 0.1133 0.0644 0.1386 0.1145 0.1200 0.0773 0.0752 0.0877 0.0877 0.0756 0.1303 0.1338 0.1285 0.1278 0.1257
va: 4.1977 1.1042 2.1390 2.1274 3.8206 3.8744 3.7695 3.8924 3.9182 3.8013 3.8777 3.8910 3.7471 4.0732 3.8317 3.8758 3.9150 3.9337 3.7148 3.9304 4.0824 3.8344 3.9815 3.7564 3.8712 3.9376 3.9134 3.8756 3.8917 1.0129 1.0152 1.0090 1.0063 1.0081 1.0144 1.0167 1.0167 1.0133 1.0110 1.0100 1.0215 0.9984 0.9951 1.0198 1.0369 0.9867 1.0075 1.0082 0.9899 0.9873 1.0060 1.0060 1.0069 1.0067 1.0133 1.0015 0.9983 0.9998
dispcorr: -0.034505418 hartree
energy: -1510.084026647315
dipole: -16.98773 16.69421 -0.29352 25.84999 -25.27954 0.57045 -1.24786 1.40342 0.15556
magnitude: 0.66013 au
magnitude: 1.67791 debye
