program: Orca
programVersion: 5.0.2
elementType: Si F O O C C C C C C C C C C C C C C C C C C C C C C C C C H H H H H H H H H H H H H H H H H H H H H H H H H H H H H
charge: 0
multiplicity: 1
keywords: wb97x-d3
keywords: def2-TZVPP
keywords: def2/J RIJCOSX
keywords: DEFGRID2
keywords: scfconv7
keywords: smallprint printgap noloewdin
keywords: NOSOSCF
formula: C25H29FO2Si
InChI: InChI=1/C25H29FO2Si/c1-4-27-21-13-15-23(16-14-21)29(2,3)18-8-9-20-12-17-24(26)25(19-20)28-22-10-6-5-7-11-22/h5-7,10-17,19H,4,8-9,18H2,1-3H3
58 atoms
Si -4.305683 1.464488 0.720762
F  2.248739 -3.80136 -0.879955
O  1.616978 2.593121 0.377476
O  1.969671 -1.451605 0.491163
C  -4.527355 -0.406666 1.031453
C  -3.285012 -1.274858 0.827285
C  -2.478756 1.904515 0.673678
C  -5.151014 2.408018 2.11725
C  -5.088935 1.93458 -0.929018
C  -2.777312 -1.303652 -0.615426
C  -1.656799 1.742298 1.786925
C  -1.858486 2.33537 -0.50424
C  -1.437608 -1.975977 -0.731042
C  -0.285703 1.964444 1.740481
C  -0.500009 2.568812 -0.575656
C  0.305893 2.372308 0.546359
C  -0.32173 -1.386204 -0.137527
C  -1.273512 -3.184294 -1.3933
C  0.915423 -1.999912 -0.177446
C  -0.03118 -3.803644 -1.458938
C  1.050012 -3.212612 -0.845455
C  2.518523 2.266065 1.416939
C  3.919207 2.488901 0.898344
C  3.079475 -1.082399 -0.213535
C  4.2979 -1.172144 0.445031
C  3.011596 -0.589185 -1.508687
C  5.455098 -0.770309 -0.201395
C  4.1801 -0.197658 -2.145666
C  5.404313 -0.285034 -1.50057
H  -4.883696 -0.539337 2.057638
H  -5.343165 -0.768888 0.396037
H  -3.486298 -2.302011 1.145207
H  -2.482352 -0.916983 1.476427
H  -6.205712 2.1401 2.202199
H  -4.685824 2.196986 3.081836
H  -5.094752 3.485742 1.959812
H  -4.652942 1.382194 -1.763342
H  -6.157049 1.711197 -0.92311
H  -4.98289 2.999042 -1.144107
H  -3.508235 -1.809322 -1.252208
H  -2.6925 -0.282798 -0.998307
H  -2.081964 1.420842 2.732059
H  -2.447661 2.485333 -1.401506
H  0.30269 1.810241 2.634625
H  -0.041042 2.893366 -1.500735
H  -0.412254 -0.436383 0.376764
H  -2.124976 -3.658723 -1.864838
H  0.096169 -4.748304 -1.970432
H  2.386249 1.220868 1.718804
H  2.329984 2.892735 2.297483
H  4.073096 3.528779 0.610743
H  4.643756 2.241643 1.673661
H  4.123571 1.854647 0.037057
H  4.330597 -1.564677 1.452786
H  2.059307 -0.504546 -2.016198
H  6.404186 -0.845482 0.312723
H  4.126947 0.184689 -3.156273
H  6.3104 0.022867 -2.004406
totalener: -1510.04865860 hartree
nucrepener: 2971.48671577 hartree
electener: -4481.53537437 hartree
oneelecener: -7972.41146542 hartree
twoeener: 3490.87609105 hartree
kineticenergy: 1503.96044673 hartree
xcener: -135.239919807819 hartree
chargesum: -0.0000000
charge: 0.443641 -0.197975 -0.277871 -0.304209 -0.282868 -0.114747 -0.078468 -0.409505 -0.405204 -0.099894 -0.187750 -0.091796 0.032218 -0.167892 -0.233740 0.288974 -0.134789 -0.111195 0.047085 -0.169839 0.282178 0.014592 -0.258127 0.215177 -0.200703 -0.097097 -0.099773 -0.129469 -0.134983 0.096277 0.079433 0.089134 0.079236 0.092945 0.088579 0.096138 0.091833 0.099970 0.102163 0.082202 0.079024 0.109961 0.119992 0.104005 0.112526 0.061209 0.106548 0.119430 0.087463 0.100737 0.094047 0.078853 0.081295 0.120717 0.123768 0.121222 0.122725 0.122595
qa: 0.4436 -0.1980 -0.2779 -0.3042 -0.2829 -0.1147 -0.0785 -0.4095 -0.4052 -0.0999 -0.1878 -0.0918 0.0322 -0.1679 -0.2337 0.2890 -0.1348 -0.1112 0.0471 -0.1698 0.2822 0.0146 -0.2581 0.2152 -0.2007 -0.0971 -0.0998 -0.1295 -0.1350 0.0963 0.0794 0.0891 0.0792 0.0929 0.0886 0.0961 0.0918 0.1000 0.1022 0.0822 0.0790 0.1100 0.1200 0.1040 0.1125 0.0612 0.1065 0.1194 0.0875 0.1007 0.0940 0.0789 0.0813 0.1207 0.1238 0.1212 0.1227 0.1226
va: 4.1197 1.0961 2.1045 2.0600 3.8474 3.8536 3.7252 3.9003 3.9010 3.7612 3.9699 3.8568 3.6900 3.8686 4.0634 3.8388 3.8811 3.9144 3.9092 3.9690 3.9911 3.8282 3.9812 3.6996 3.9918 3.8951 3.9226 3.9572 3.9208 1.0080 1.0120 1.0125 1.0115 1.0118 1.0149 1.0142 1.0123 1.0151 1.0098 1.0163 1.0287 0.9994 0.9955 1.0208 1.0192 1.0360 1.0119 1.0088 0.9835 0.9898 1.0108 1.0082 1.0044 1.0161 1.0101 1.0008 1.0018 1.0017
dispcorr: -0.034502984 hartree
energy: -1510.083161584346
dipole: -20.67296 20.41658 -0.25638 18.84476 -18.68919 0.15557 6.17912 -6.10477 0.07435
magnitude: 0.30897 au
magnitude: 0.78533 debye
