program: Orca
programVersion: 5.0.2
elementType: Si F O O C C C C C C C C C C C C C C C C C C C C C C C C C H H H H H H H H H H H H H H H H H H H H H H H H H H H H H
charge: 0
multiplicity: 1
keywords: wb97x-d3
keywords: def2-TZVPP
keywords: def2/J RIJCOSX
keywords: DEFGRID2
keywords: scfconv7
keywords: smallprint printgap noloewdin
keywords: NOSOSCF
formula: C25H29FO2Si
InChI: InChI=1/C25H29FO2Si/c1-4-27-21-13-15-23(16-14-21)29(2,3)18-8-9-20-12-17-24(26)25(19-20)28-22-10-6-5-7-11-22/h5-7,10-17,19H,4,8-9,18H2,1-3H3
58 atoms
Si -3.769003 1.437701 -0.043566
F  1.690141 -3.695406 -1.555521
O  1.946789 2.752248 1.401563
O  1.333779 -1.007185 -1.440748
C  -3.84742 -0.359434 -0.6626
C  -3.946533 -1.451213 0.405551
C  -2.012344 1.941153 0.391174
C  -4.864467 1.623821 1.480436
C  -4.396956 2.552039 -1.429772
C  -2.700425 -1.62766 1.281657
C  -1.56401 2.028617 1.713313
C  -1.060986 2.156427 -0.604528
C  -1.518071 -2.181847 0.535443
C  -0.246225 2.299046 2.024538
C  0.271827 2.421932 -0.318638
C  0.690563 2.496197 1.008448
C  -0.58837 -1.33584 -0.062478
C  -1.3380 -3.554996 0.405559
C  0.477638 -1.842618 -0.783779
C  -0.260515 -4.078039 -0.295032
C  0.642192 -3.216593 -0.882106
C  2.95226 2.936999 0.422392
C  4.245522 3.251004 1.135093
C  2.554616 -0.747493 -0.8977
C  2.834918 -0.894807 0.45424
C  3.529386 -0.275993 -1.769866
C  4.101608 -0.575604 0.923018
C  4.787219 0.040983 -1.285497
C  5.083286 -0.109935 0.062731
H  -4.731416 -0.428559 -1.306049
H  -2.997872 -0.553993 -1.325395
H  -4.168174 -2.411006 -0.071739
H  -4.797683 -1.242376 1.060076
H  -5.896927 1.352673 1.253098
H  -4.542339 0.986844 2.306362
H  -4.870137 2.652489 1.843576
H  -5.432352 2.321392 -1.686266
H  -4.351908 3.604041 -1.146159
H  -3.808624 2.436691 -2.341797
H  -2.427367 -0.674975 1.742227
H  -2.949366 -2.302272 2.104765
H  -2.259769 1.878123 2.531118
H  -1.34782 2.096959 -1.64892
H  0.077464 2.36141 3.05561
H  0.966607 2.556338 -1.136037
H  -0.690875 -0.262386 0.024278
H  -2.045267 -4.234911 0.864846
H  -0.117663 -5.14659 -0.385628
H  2.68247 3.760902 -0.249502
H  3.063018 2.033417 -0.185485
H  4.167741 4.169728 1.716024
H  4.530723 2.439442 1.80298
H  5.044303 3.377432 0.4048
H  2.077631 -1.247062 1.142031
H  3.295854 -0.171532 -2.821265
H  4.315301 -0.691548 1.977434
H  5.544011 0.400675 -1.970317
H  6.067892 0.134256 0.437578
totalener: -1510.04954361 hartree
nucrepener: 3005.25154658 hartree
electener: -4515.30109019 hartree
oneelecener: -8039.91684148 hartree
twoeener: 3524.61575129 hartree
kineticenergy: 1503.95984377 hartree
xcener: -135.242744198857 hartree
chargesum: -0.0000000
charge: 0.442586 -0.196397 -0.282222 -0.291651 -0.266308 -0.144225 -0.090907 -0.411739 -0.419230 -0.129958 -0.101795 -0.127954 0.015286 -0.225029 -0.212096 0.308600 -0.126512 -0.112235 0.081029 -0.194908 0.295235 0.054174 -0.272239 0.221367 -0.100309 -0.183361 -0.146095 -0.098580 -0.159631 0.092569 0.086284 0.088500 0.079674 0.103673 0.085807 0.111915 0.092173 0.098305 0.088959 0.080018 0.090132 0.119848 0.103270 0.112681 0.103072 0.073306 0.112246 0.119909 0.100124 0.051286 0.096719 0.084279 0.081578 0.125848 0.119058 0.125245 0.122231 0.126398
qa: 0.4426 -0.1964 -0.2822 -0.2917 -0.2663 -0.1442 -0.0909 -0.4117 -0.4192 -0.1300 -0.1018 -0.1280 0.0153 -0.2250 -0.2121 0.3086 -0.1265 -0.1122 0.0810 -0.1949 0.2952 0.0542 -0.2722 0.2214 -0.1003 -0.1834 -0.1461 -0.0986 -0.1596 0.0926 0.0863 0.0885 0.0797 0.1037 0.0858 0.1119 0.0922 0.0983 0.0890 0.0800 0.0901 0.1198 0.1033 0.1127 0.1031 0.0733 0.1122 0.1199 0.1001 0.0513 0.0967 0.0843 0.0816 0.1258 0.1191 0.1252 0.1222 0.1264
va: 4.1500 1.1020 2.1077 2.0906 3.8204 3.9040 3.6905 3.9044 3.9121 3.8258 3.8688 3.9403 3.7161 4.0785 3.8832 3.8184 3.7577 3.9043 3.8572 3.9822 4.0265 3.8063 3.9781 3.7390 3.8268 3.9659 3.9351 3.9080 3.8854 1.0094 1.0162 1.0050 1.0023 1.0107 1.0106 1.0117 1.0135 1.0131 1.0155 1.0257 1.0114 0.9930 1.0043 1.0193 1.0218 1.0280 1.0071 1.0085 0.9961 0.9876 1.0093 1.0072 1.0071 1.0110 1.0176 1.0019 1.0008 1.0011
dispcorr: -0.035596700 hartree
energy: -1510.085140311579
dipole: -16.51736 16.39578 -0.12157 19.10132 -18.95459 0.14673 7.93194 -7.67735 0.25458
magnitude: 0.31800 au
magnitude: 0.80829 debye
