program: Orca
programVersion: 5.0.2
elementType: Si F O O C C C C C C C C C C C C C C C C C C C C C C C C C H H H H H H H H H H H H H H H H H H H H H H H H H H H H H
charge: 0
multiplicity: 1
keywords: wb97x-d3
keywords: def2-TZVPP
keywords: def2/J RIJCOSX
keywords: DEFGRID2
keywords: scfconv7
keywords: smallprint printgap noloewdin
keywords: NOSOSCF
formula: C25H29FO2Si
InChI: InChI=1/C25H29FO2Si/c1-4-27-21-13-15-23(16-14-21)29(2,3)18-8-9-20-12-17-24(26)25(19-20)28-22-10-6-5-7-11-22/h5-7,10-17,19H,4,8-9,18H2,1-3H3
58 atoms
Si -3.457244 1.775434 0.488715
F  1.945633 -4.734089 0.743757
O  1.698004 2.657107 -2.535779
O  2.414814 -2.106387 0.469267
C  -4.117817 0.0425 0.090397
C  -3.100844 -1.082506 0.322962
C  -1.836808 2.098927 -0.398556
C  -3.162199 1.880908 2.349275
C  -4.740658 3.05275 -0.032441
C  -2.248625 -1.393391 -0.912029
C  -1.804844 2.569008 -1.715693
C  -0.606804 1.823232 0.194771
C  -1.112543 -2.311091 -0.562161
C  -0.619903 2.741034 -2.402485
C  0.599255 1.97619 -0.478045
C  0.598433 2.440402 -1.790869
C  0.135101 -1.77919 -0.258505
C  -1.295463 -3.685064 -0.447002
C  1.171102 -2.585715 0.18867
C  -0.263059 -4.506149 -0.022008
C  0.956485 -3.9514 0.308833
C  2.939747 2.099128 -2.151023
C  3.017609 0.611267 -2.431088
C  2.561376 -0.971026 1.206313
C  1.655963 -0.569313 2.181746
C  3.708256 -0.223348 0.969332
C  1.898123 0.59336 2.898302
C  3.940437 0.931852 1.698588
C  3.03238 1.354392 2.658921
H  -4.997612 -0.112314 0.723639
H  -4.492296 0.004233 -0.937643
H  -3.608731 -2.000941 0.631711
H  -2.432538 -0.834045 1.154735
H  -4.097439 1.77263 2.901203
H  -2.488218 1.102161 2.710656
H  -2.726712 2.841968 2.626268
H  -4.945151 3.015192 -1.103714
H  -5.690217 2.885108 0.478931
H  -4.415237 4.06679 0.202531
H  -2.88203 -1.84401 -1.681288
H  -1.857661 -0.465994 -1.335541
H  -2.729851 2.807382 -2.229032
H  -0.562396 1.46828 1.218224
H  -0.618692 3.106057 -3.421569
H  1.517416 1.735782 0.043297
H  0.293782 -0.712054 -0.363286
H  -2.255358 -4.123367 -0.690237
H  -0.399816 -5.575579 0.068105
H  3.167947 2.311953 -1.101361
H  3.68099 2.631017 -2.747929
H  2.312105 0.037854 -1.830467
H  2.817072 0.403318 -3.481601
H  4.017725 0.242374 -2.202141
H  0.770328 -1.15586 2.387387
H  4.413685 -0.558255 0.220543
H  1.190115 0.901069 3.65678
H  4.837586 1.507178 1.510847
H  3.211187 2.260467 3.221141
totalener: -1510.04662829 hartree
nucrepener: 3005.36373003 hartree
electener: -4515.41035833 hartree
oneelecener: -8039.61234630 hartree
twoeener: 3524.20198798 hartree
kineticenergy: 1503.95535056 hartree
xcener: -135.242753187878 hartree
chargesum: 0.0000000
charge: 0.430524 -0.192845 -0.293917 -0.295254 -0.251140 -0.124795 -0.124673 -0.394313 -0.420681 -0.109764 -0.052767 -0.148631 -0.021524 -0.223965 -0.154113 0.286027 -0.122542 -0.140317 0.178424 -0.171630 0.203120 0.035743 -0.249378 0.287921 -0.167110 -0.229712 -0.151478 -0.124474 -0.109982 0.085057 0.072979 0.090520 0.068624 0.098471 0.078948 0.107793 0.086217 0.093167 0.101695 0.087759 0.090361 0.102607 0.111358 0.113375 0.075909 0.083411 0.114964 0.120189 0.067154 0.099829 0.072769 0.104026 0.079262 0.131917 0.131450 0.129797 0.127219 0.126420
qa: 0.4305 -0.1928 -0.2939 -0.2953 -0.2511 -0.1248 -0.1247 -0.3943 -0.4207 -0.1098 -0.0528 -0.1486 -0.0215 -0.2240 -0.1541 0.2860 -0.1225 -0.1403 0.1784 -0.1716 0.2031 0.0357 -0.2494 0.2879 -0.1671 -0.2297 -0.1515 -0.1245 -0.1100 0.0851 0.0730 0.0905 0.0686 0.0985 0.0789 0.1078 0.0862 0.0932 0.1017 0.0878 0.0904 0.1026 0.1114 0.1134 0.0759 0.0834 0.1150 0.1202 0.0672 0.0998 0.0728 0.1040 0.0793 0.1319 0.1315 0.1298 0.1272 0.1264
va: 4.1992 1.1050 2.1196 2.1179 3.8203 3.8766 3.7654 3.8904 3.9199 3.8060 3.8825 3.8308 3.8030 4.0706 3.8105 3.8815 3.8553 3.9164 3.6423 3.9406 4.0879 3.8912 3.9185 3.7732 3.8639 3.9287 3.9268 3.8975 3.9028 1.0128 1.0153 1.0090 1.0052 1.0141 1.0173 1.0081 1.0168 1.0135 1.0114 1.0106 1.0186 0.9973 0.9967 1.0194 1.0302 1.0199 1.0072 1.0083 0.9975 0.9927 0.9979 1.0122 1.0138 1.0053 1.0092 1.0008 0.9999 0.9992
dispcorr: -0.036558935 hartree
energy: -1510.083187225789
dipole: -19.48438 19.13792 -0.34646 20.88472 -20.51211 0.37261 -0.99413 1.10107 0.10694
magnitude: 0.51991 au
magnitude: 1.32151 debye
