program: Orca
programVersion: 5.0.2
elementType: Si F O O C C C C C C C C C C C C C C C C C C C C C C C C C H H H H H H H H H H H H H H H H H H H H H H H H H H H H H
charge: 0
multiplicity: 1
keywords: wb97x-d3
keywords: def2-TZVPP
keywords: def2/J RIJCOSX
keywords: DEFGRID2
keywords: scfconv7
keywords: smallprint printgap noloewdin
keywords: NOSOSCF
formula: C25H29FO2Si
InChI: InChI=1/C25H29FO2Si/c1-4-27-21-13-15-23(16-14-21)29(2,3)18-8-9-20-12-17-24(26)25(19-20)28-22-10-6-5-7-11-22/h5-7,10-17,19H,4,8-9,18H2,1-3H3
58 atoms
Si -3.932893 1.608041 1.066142
F  2.158401 -4.396562 -0.674677
O  1.621366 3.231776 -0.619929
O  1.992263 -1.82454 -1.546489
C  -4.157192 0.086497 -0.047045
C  -2.985865 -0.885176 0.09325
C  -2.217454 2.261906 0.674494
C  -4.042685 1.105702 2.878932
C  -5.249283 2.898592 0.680978
C  -2.864527 -1.9075 -1.04061
C  -1.105376 1.895108 1.428248
C  -1.96809 2.985404 -0.497169
C  -1.540328 -2.616784 -0.985489
C  0.193165 2.199378 1.040316
C  -0.688039 3.30868 -0.90068
C  0.411459 2.904418 -0.140134
C  -0.376734 -1.915324 -1.300285
C  -1.42186 -3.934547 -0.565438
C  0.865556 -2.510426 -1.199248
C  -0.179308 -4.548046 -0.462731
C  0.954172 -3.831727 -0.777319
C  2.77527 2.765928 0.054603
C  3.985845 3.186523 -0.743906
C  2.788931 -1.323665 -0.562849
C  4.037422 -0.859703 -0.963534
C  2.406588 -1.240671 0.770001
C  4.906591 -0.330836 -0.025587
C  3.291921 -0.708997 1.698569
C  4.542617 -0.254251 1.312846
H  -5.110743 -0.41489 0.146052
H  -4.211813 0.445471 -1.081671
H  -3.044295 -1.415214 1.048711
H  -2.05103 -0.320138 0.128411
H  -3.336411 0.314438 3.134605
H  -3.845386 1.948988 3.54236
H  -5.040235 0.731494 3.115334
H  -6.250688 2.510996 0.875892
H  -5.118615 3.792796 1.291785
H  -5.225245 3.212315 -0.363797
H  -3.686619 -2.626153 -0.999358
H  -2.959059 -1.386274 -1.997821
H  -1.237246 1.335799 2.34756
H  -2.794127 3.301066 -1.125357
H  1.017009 1.869777 1.658551
H  -0.518624 3.865597 -1.813416
H  -0.429976 -0.883146 -1.628055
H  -2.310604 -4.498996 -0.312634
H  -0.089356 -5.576644 -0.139864
H  2.749202 1.675743 0.153548
H  2.821875 3.18732 1.066238
H  4.037232 4.269756 -0.851135
H  4.890419 2.852296 -0.236975
H  3.975219 2.739637 -1.737431
H  4.31961 -0.928653 -2.005877
H  1.431773 -1.581747 1.092264
H  5.879511 0.019417 -0.344691
H  2.992219 -0.654568 2.737119
H  5.227754 0.151522 2.04451
totalener: -1510.04981072 hartree
nucrepener: 2924.90804937 hartree
electener: -4434.95786009 hartree
oneelecener: -7878.96721725 hartree
twoeener: 3444.00935715 hartree
kineticenergy: 1503.95535261 hartree
xcener: -135.236698012131 hartree
chargesum: -0.0000000
charge: 0.453270 -0.194590 -0.287936 -0.299299 -0.240665 -0.101452 -0.146846 -0.401411 -0.408530 -0.106532 -0.102184 -0.054063 0.048142 -0.244583 -0.267632 0.345806 -0.196453 -0.138240 0.112955 -0.161642 0.241393 0.117921 -0.273905 0.304939 -0.201220 -0.147899 -0.123061 -0.147280 -0.151016 0.078166 0.066823 0.082875 0.058489 0.086004 0.106253 0.097713 0.092740 0.100272 0.085973 0.072938 0.085244 0.111753 0.102234 0.098570 0.112438 0.121883 0.111344 0.122256 0.010250 0.086911 0.096922 0.075312 0.088639 0.122853 0.121317 0.126197 0.125557 0.124085
qa: 0.4533 -0.1946 -0.2879 -0.2993 -0.2407 -0.1015 -0.1468 -0.4014 -0.4085 -0.1065 -0.1022 -0.0541 0.0481 -0.2446 -0.2676 0.3458 -0.1965 -0.1382 0.1130 -0.1616 0.2414 0.1179 -0.2739 0.3049 -0.2012 -0.1479 -0.1231 -0.1473 -0.1510 0.0782 0.0668 0.0829 0.0585 0.0860 0.1063 0.0977 0.0927 0.1003 0.0860 0.0729 0.0852 0.1118 0.1022 0.0986 0.1124 0.1219 0.1113 0.1223 0.0102 0.0869 0.0969 0.0753 0.0886 0.1229 0.1213 0.1262 0.1256 0.1241
va: 4.1910 1.1023 2.1359 2.1163 3.8307 3.8503 3.7979 3.9008 3.9131 3.8410 3.9180 3.9051 3.6851 3.9363 4.0909 3.8172 3.9733 3.9381 3.8171 3.9368 4.0567 3.8110 3.9756 3.7504 3.9817 3.8416 3.8908 3.9041 3.8947 1.0186 1.0183 1.0107 1.0183 1.0128 1.0096 1.0128 1.0133 1.0114 1.0162 1.0160 1.0089 0.9998 0.9989 1.0247 1.0206 1.0151 1.0105 1.0077 1.0034 0.9895 1.0095 1.0083 1.0071 1.0165 1.0154 0.9996 1.0012 1.0018
dispcorr: -0.032251940 hartree
energy: -1510.082062658667
dipole: -18.44796 18.13345 -0.31451 21.66805 -21.69692 -0.02887 9.84594 -9.33053 0.51541
magnitude: 0.60448 au
magnitude: 1.53647 debye
