program: Orca
programVersion: 5.0.2
elementType: Si F O O C C C C C C C C C C C C C C C C C C C C C C C C C H H H H H H H H H H H H H H H H H H H H H H H H H H H H H
charge: 0
multiplicity: 1
keywords: wb97x-d3
keywords: def2-TZVPP
keywords: def2/J RIJCOSX
keywords: DEFGRID2
keywords: scfconv7
keywords: smallprint printgap noloewdin
keywords: NOSOSCF
formula: C25H29FO2Si
InChI: InChI=1/C25H29FO2Si/c1-4-27-21-13-15-23(16-14-21)29(2,3)18-8-9-20-12-17-24(26)25(19-20)28-22-10-6-5-7-11-22/h5-7,10-17,19H,4,8-9,18H2,1-3H3
58 atoms
Si -2.765627 1.362024 0.391516
F  0.994701 -5.215597 0.557375
O  2.423587 4.405948 0.949477
O  1.680842 -3.197366 -1.094358
C  -2.341899 -0.083248 -0.74973
C  -3.471292 -1.07541 -1.011871
C  -1.188396 2.351887 0.63413
C  -3.379186 0.712013 2.050598
C  -4.092805 2.439474 -0.404764
C  -3.068832 -2.240085 -1.930247
C  -0.615451 2.572259 1.881986
C  -0.501369 2.866322 -0.472127
C  -1.985221 -3.091195 -1.330954
C  0.583261 3.261635 2.039818
C  0.686775 3.554066 -0.343093
C  1.247147 3.752715 0.919896
C  -0.646093 -2.783288 -1.541851
C  -2.29325 -4.15816 -0.492372
C  0.365958 -3.488149 -0.905857
C  -1.293036 -4.88813 0.130588
C  0.028035 -4.539985 -0.066827
C  3.049449 4.644685 2.192619
C  4.343204 5.379749 1.930618
C  2.089188 -1.904124 -0.915858
C  1.529304 -1.072297 0.046304
C  3.121868 -1.448377 -1.722279
C  1.997567 0.225009 0.182681
C  3.590769 -0.152497 -1.564554
C  3.027475 0.692962 -0.620112
H  -1.975821 0.319181 -1.701872
H  -1.482125 -0.595583 -0.307636
H  -4.323235 -0.561049 -1.46674
H  -3.835994 -1.486987 -0.06566
H  -3.596215 1.519836 2.751294
H  -4.300883 0.140663 1.928594
H  -2.650388 0.050527 2.521859
H  -4.35691 3.282483 0.23508
H  -3.755669 2.851306 -1.357545
H  -5.00763 1.876758 -0.599543
H  -3.948781 -2.854242 -2.137402
H  -2.739112 -1.836958 -2.891619
H  -1.101806 2.196417 2.774834
H  -0.897129 2.719676 -1.47135
H  0.981278 3.397898 3.036268
H  1.204957 3.932907 -1.214647
H  -0.378421 -1.963693 -2.19863
H  -3.328486 -4.425253 -0.31944
H  -1.531464 -5.718243 0.782143
H  3.248723 3.698388 2.710086
H  2.397055 5.240917 2.841973
H  4.163196 6.332408 1.433853
H  4.851104 5.581993 2.873196
H  5.014019 4.788918 1.30777
H  0.732679 -1.427579 0.687345
H  3.550184 -2.108318 -2.46511
H  1.547157 0.874111 0.921833
H  4.396092 0.19927 -2.196096
H  3.380864 1.709478 -0.508753
totalener: -1510.04970257 hartree
nucrepener: 2901.66040740 hartree
electener: -4411.71010997 hartree
oneelecener: -7832.58520893 hartree
twoeener: 3420.87509896 hartree
kineticenergy: 1503.95313563 hartree
xcener: -135.237441101437 hartree
chargesum: 0.0000000
charge: 0.454114 -0.192558 -0.287638 -0.298449 -0.209453 -0.127387 -0.148825 -0.426049 -0.379386 -0.136865 -0.128539 -0.020361 0.108259 -0.205161 -0.301038 0.330995 -0.237681 -0.183712 0.178999 -0.149330 0.183961 0.036512 -0.256522 0.261833 -0.191753 -0.215073 -0.086318 -0.082414 -0.165648 0.074974 0.055106 0.075942 0.073368 0.098352 0.097149 0.103244 0.099456 0.091983 0.089412 0.085813 0.083329 0.110458 0.096637 0.103118 0.111342 0.131100 0.111367 0.120652 0.081215 0.085813 0.087096 0.079018 0.086220 0.129773 0.124053 0.142950 0.122437 0.124108
qa: 0.4541 -0.1926 -0.2876 -0.2984 -0.2095 -0.1274 -0.1488 -0.4260 -0.3794 -0.1369 -0.1285 -0.0204 0.1083 -0.2052 -0.3010 0.3310 -0.2377 -0.1837 0.1790 -0.1493 0.1840 0.0365 -0.2565 0.2618 -0.1918 -0.2151 -0.0863 -0.0824 -0.1656 0.0750 0.0551 0.0759 0.0734 0.0984 0.0971 0.1032 0.0995 0.0920 0.0894 0.0858 0.0833 0.1105 0.0966 0.1031 0.1113 0.1311 0.1114 0.1207 0.0812 0.0858 0.0871 0.0790 0.0862 0.1298 0.1241 0.1430 0.1224 0.1241
va: 4.1565 1.1056 2.0959 2.1196 3.8122 3.9014 3.8290 3.9214 3.8953 3.8994 3.9432 3.8414 3.5865 3.9163 4.0724 3.7499 3.9422 3.9598 3.7421 3.9131 4.1121 3.8436 3.9882 3.7914 3.9417 4.0385 3.8883 3.9523 3.9591 1.0178 1.0411 1.0109 1.0044 1.0113 1.0136 1.0072 1.0129 1.0122 1.0116 1.0101 1.0110 0.9995 1.0006 1.0217 1.0220 1.0062 1.0093 1.0072 0.9851 0.9870 1.0054 1.0074 1.0048 1.0061 1.0132 0.9811 0.9991 1.0053
dispcorr: -0.032184581 hartree
energy: -1510.081887151413
dipole: -13.75349 13.23479 -0.51870 30.48409 -29.48445 0.99964 4.97015 -4.63184 0.33831
magnitude: 1.17591 au
magnitude: 2.98894 debye
