program: Orca
programVersion: 5.0.2
elementType: Si F O O C C C C C C C C C C C C C C C C C C C C C C C C C H H H H H H H H H H H H H H H H H H H H H H H H H H H H H
charge: 0
multiplicity: 1
keywords: wb97x-d3
keywords: def2-TZVPP
keywords: def2/J RIJCOSX
keywords: DEFGRID2
keywords: scfconv7
keywords: smallprint printgap noloewdin
keywords: NOSOSCF
formula: C25H29FO2Si
InChI: InChI=1/C25H29FO2Si/c1-4-27-21-13-15-23(16-14-21)29(2,3)18-8-9-20-12-17-24(26)25(19-20)28-22-10-6-5-7-11-22/h5-7,10-17,19H,4,8-9,18H2,1-3H3
58 atoms
Si -3.570367 1.861316 0.245196
F  1.532209 -5.354701 0.769029
O  2.150155 3.806814 0.372179
O  2.14981 -3.219018 -0.721221
C  -3.594849 0.270829 -0.782631
C  -2.603573 -0.780154 -0.290347
C  -1.800685 2.482994 0.335188
C  -4.202629 1.512522 1.986246
C  -4.662954 3.152078 -0.586032
C  -2.599688 -2.062666 -1.128428
C  -1.032547 2.626923 -0.827055
C  -1.182943 2.811986 1.536234
C  -1.523476 -3.007625 -0.673798
C  0.272175 3.072709 -0.79337
C  0.129361 3.26893 1.597644
C  0.866719 3.399919 0.426353
C  -0.195809 -2.707919 -0.960483
C  -1.799884 -4.134426 0.089814
C  0.841338 -3.48466 -0.470276
C  -0.77302 -4.939156 0.564553
C  0.536396 -4.604247 0.293518
C  2.82415 4.117022 1.573893
C  4.252177 4.473572 1.234671
C  2.562046 -1.915527 -0.711749
C  2.110148 -1.007491 0.238342
C  3.479267 -1.526564 -1.675521
C  2.560599 0.300668 0.196027
C  3.933488 -0.215872 -1.695939
C  3.468013 0.707193 -0.771991
H  -4.612684 -0.135182 -0.785505
H  -3.378621 0.519071 -1.828406
H  -2.812923 -1.044602 0.750873
H  -1.595087 -0.356258 -0.288317
H  -5.219161 1.116914 1.955222
H  -3.584695 0.779193 2.506616
H  -4.229926 2.414757 2.599382
H  -5.692831 2.804887 -0.685795
H  -4.682018 4.081949 -0.016164
H  -4.30231 3.394274 -1.587044
H  -3.578684 -2.545411 -1.070348
H  -2.447289 -1.802743 -2.18028
H  -1.460135 2.376529 -1.792303
H  -1.726047 2.714406 2.468993
H  0.852292 3.161535 -1.702587
H  0.553477 3.512623 2.562219
H  0.037178 -1.83568 -1.560151
H  -2.825783 -4.390369 0.322756
H  -0.982601 -5.817334 1.160564
H  2.803622 3.26084 2.259501
H  2.332228 4.954368 2.083397
H  4.769775 3.635325 0.768822
H  4.298095 5.326696 0.558919
H  4.793014 4.73492 2.143776
H  1.402703 -1.311545 0.998709
H  3.827025 -2.247537 -2.403565
H  2.188933 1.004997 0.927078
H  4.645557 0.085623 -2.452861
H  3.798604 1.73612 -0.807005
totalener: -1510.05001062 hartree
nucrepener: 2877.73849538 hartree
electener: -4387.78850600 hartree
oneelecener: -7784.64501959 hartree
twoeener: 3396.85651359 hartree
kineticenergy: 1503.96790803 hartree
xcener: -135.237750519908 hartree
chargesum: -0.0000000
charge: 0.440811 -0.193691 -0.284565 -0.296107 -0.278810 -0.093896 -0.129515 -0.416574 -0.377581 -0.089562 -0.077774 -0.109404 0.061324 -0.222435 -0.200464 0.274449 -0.200386 -0.172419 0.161069 -0.144618 0.179955 0.012606 -0.253039 0.259158 -0.179924 -0.216414 -0.076057 -0.089786 -0.152537 0.079619 0.074286 0.080953 0.069551 0.100585 0.098414 0.095988 0.091587 0.095289 0.090941 0.069833 0.083748 0.102842 0.110587 0.110812 0.104556 0.123621 0.107785 0.119978 0.083268 0.100070 0.082443 0.089671 0.084004 0.128265 0.124454 0.117707 0.123192 0.122136
qa: 0.4408 -0.1937 -0.2846 -0.2961 -0.2788 -0.0939 -0.1295 -0.4166 -0.3776 -0.0896 -0.0778 -0.1094 0.0613 -0.2224 -0.2005 0.2744 -0.2004 -0.1724 0.1611 -0.1446 0.1800 0.0126 -0.2530 0.2592 -0.1799 -0.2164 -0.0761 -0.0898 -0.1525 0.0796 0.0743 0.0810 0.0696 0.1006 0.0984 0.0960 0.0916 0.0953 0.0909 0.0698 0.0837 0.1028 0.1106 0.1108 0.1046 0.1236 0.1078 0.1200 0.0833 0.1001 0.0824 0.0897 0.0840 0.1283 0.1245 0.1177 0.1232 0.1221
va: 4.1768 1.1037 2.0865 2.1186 3.8531 3.8091 3.7991 3.9108 3.8996 3.8312 3.8761 3.9842 3.6823 4.0426 3.9266 3.8069 3.9125 3.9527 3.7673 3.9112 4.0953 3.8429 3.9773 3.7905 3.9665 4.0458 3.8813 3.9627 3.9341 1.0207 1.0178 1.0105 1.0140 1.0129 1.0089 1.0111 1.0115 1.0124 1.0132 1.0166 1.0093 0.9976 0.9977 1.0211 1.0196 1.0086 1.0117 1.0075 0.9820 0.9890 1.0055 1.0053 1.0081 1.0062 1.0129 0.9945 0.9995 1.0120
dispcorr: -0.031025067 hartree
energy: -1510.081035685428
dipole: -17.13659 16.66091 -0.47568 32.35391 -31.25325 1.10066 3.53082 -3.20502 0.32580
magnitude: 1.24252 au
magnitude: 3.15824 debye
