program: Orca
programVersion: 5.0.2
elementType: Si F O O C C C C C C C C C C C C C C C C C C C C C C C C C H H H H H H H H H H H H H H H H H H H H H H H H H H H H H
charge: 0
multiplicity: 1
keywords: wb97x-d3
keywords: def2-TZVPP
keywords: def2/J RIJCOSX
keywords: DEFGRID2
keywords: scfconv7
keywords: smallprint printgap noloewdin
keywords: NOSOSCF
formula: C25H29FO2Si
InChI: InChI=1/C25H29FO2Si/c1-4-27-21-13-15-23(16-14-21)29(2,3)18-8-9-20-12-17-24(26)25(19-20)28-22-10-6-5-7-11-22/h5-7,10-17,19H,4,8-9,18H2,1-3H3
58 atoms
Si -3.451107 1.428373 0.534718
F  0.656128 -3.962556 -3.270784
O  2.091438 3.815649 0.802063
O  1.99511 -3.042247 -1.138284
C  -3.211505 -0.442088 0.36951
C  -2.384451 -1.067872 1.490002
C  -1.766906 2.250127 0.652304
C  -4.446316 1.804794 2.092373
C  -4.374518 2.067706 -0.977846
C  -2.213269 -2.585912 1.360176
C  -1.066767 2.285488 1.855751
C  -1.121284 2.790375 -0.464407
C  -1.457221 -2.985987 0.124335
C  0.216951 2.804408 1.95717
C  0.152437 3.319814 -0.388494
C  0.840505 3.318836 0.825112
C  -0.077638 -2.815647 0.068938
C  -2.105668 -3.502121 -0.991892
C  0.641619 -3.140136 -1.070952
C  -1.399048 -3.83759 -2.137503
C  -0.033685 -3.648536 -2.17273
C  2.882042 3.725927 1.96967
C  4.252355 4.277514 1.655289
C  2.611595 -1.869593 -0.812478
C  3.923197 -1.967599 -0.365949
C  2.006117 -0.626926 -0.94893
C  4.63024 -0.817094 -0.058687
C  2.726153 0.515767 -0.633538
C  4.03537 0.4300 -0.18618
H  -4.197019 -0.921023 0.323099
H  -2.738204 -0.643617 -0.597128
H  -2.847816 -0.861041 2.459722
H  -1.39532 -0.601396 1.522219
H  -4.619828 2.876004 2.201981
H  -5.421309 1.315048 2.061963
H  -3.946747 1.464079 3.000705
H  -3.866506 1.811378 -1.908882
H  -5.376056 1.6378 -1.032909
H  -4.486772 3.152509 -0.951338
H  -1.691816 -2.962547 2.244472
H  -3.197591 -3.0615 1.358919
H  -1.521235 1.891804 2.758116
H  -1.620623 2.800315 -1.426474
H  0.711315 2.795493 2.918748
H  0.633245 3.733642 -1.266101
H  0.453832 -2.423803 0.928917
H  -3.178031 -3.648552 -0.968972
H  -1.902996 -4.240569 -3.005867
H  2.958127 2.682167 2.297188
H  2.425818 4.295676 2.78796
H  4.884772 4.217716 2.540631
H  4.734937 3.711299 0.859131
H  4.199696 5.321197 1.347868
H  4.380788 -2.943454 -0.270665
H  0.986067 -0.537308 -1.29892
H  5.652879 -0.899769 0.285329
H  2.252641 1.480667 -0.745849
H  4.589184 1.328437 0.051777
totalener: -1510.05026933 hartree
nucrepener: 2898.16063543 hartree
electener: -4408.21090476 hartree
oneelecener: -7825.44942305 hartree
twoeener: 3417.23851829 hartree
kineticenergy: 1503.95843217 hartree
xcener: -135.236889984407 hartree
chargesum: 0.0000000
charge: 0.438599 -0.192396 -0.286338 -0.294833 -0.216663 -0.124270 -0.107281 -0.384869 -0.428646 -0.136912 -0.152085 -0.046422 0.050523 -0.179843 -0.273355 0.281959 -0.171304 -0.169392 0.149874 -0.140814 0.187137 0.010570 -0.255827 0.265745 -0.212238 -0.153743 -0.098176 -0.131974 -0.170237 0.069557 0.082594 0.082673 0.075578 0.104222 0.095562 0.081588 0.088786 0.095174 0.103101 0.094826 0.076333 0.110095 0.109725 0.104357 0.121233 0.122555 0.109549 0.120921 0.091067 0.094106 0.080991 0.082115 0.091214 0.124060 0.124956 0.121762 0.153925 0.130586
qa: 0.4386 -0.1924 -0.2863 -0.2948 -0.2167 -0.1243 -0.1073 -0.3849 -0.4286 -0.1369 -0.1521 -0.0464 0.0505 -0.1798 -0.2734 0.2820 -0.1713 -0.1694 0.1499 -0.1408 0.1871 0.0106 -0.2558 0.2657 -0.2122 -0.1537 -0.0982 -0.1320 -0.1702 0.0696 0.0826 0.0827 0.0756 0.1042 0.0956 0.0816 0.0888 0.0952 0.1031 0.0948 0.0763 0.1101 0.1097 0.1044 0.1212 0.1226 0.1095 0.1209 0.0911 0.0941 0.0810 0.0821 0.0912 0.1241 0.1250 0.1218 0.1539 0.1306
va: 4.1967 1.1059 2.0903 2.1174 3.7976 3.8680 3.7671 3.8906 3.9274 3.8996 3.9846 3.8665 3.6399 3.9560 4.0051 3.8195 3.9414 3.9149 3.7685 3.9091 4.1078 3.8439 3.9834 3.7932 4.0302 3.9188 3.9576 3.9317 3.9653 1.0175 1.0172 1.0072 1.0046 1.0104 1.0105 1.0166 1.0146 1.0144 1.0111 1.0073 1.0119 0.9962 0.9951 1.0176 1.0171 1.0108 1.0111 1.0067 0.9833 0.9882 1.0067 1.0070 1.0061 1.0144 1.0123 1.0004 0.9910 0.9954
dispcorr: -0.031262957 hartree
energy: -1510.081532286478
dipole: -13.12157 12.79693 -0.32464 24.73502 -24.15262 0.58240 20.02701 -18.89539 1.13162
magnitude: 1.31345 au
magnitude: 3.33852 debye
