program: Orca
programVersion: 5.0.2
elementType: Si F O O C C C C C C C C C C C C C C C C C C C C C C C C C H H H H H H H H H H H H H H H H H H H H H H H H H H H H H
charge: 0
multiplicity: 1
keywords: wb97x-d3
keywords: def2-TZVPP
keywords: def2/J RIJCOSX
keywords: DEFGRID2
keywords: scfconv7
keywords: smallprint printgap noloewdin
keywords: NOSOSCF
formula: C25H29FO2Si
InChI: InChI=1/C25H29FO2Si/c1-4-27-21-13-15-23(16-14-21)29(2,3)18-8-9-20-12-17-24(26)25(19-20)28-22-10-6-5-7-11-22/h5-7,10-17,19H,4,8-9,18H2,1-3H3
58 atoms
Si -3.395301 1.403628 0.525781
F  0.488894 -4.008225 -3.344191
O  2.101392 3.89454 0.835184
O  1.912072 -3.015308 -1.311567
C  -3.154467 -0.468091 0.386518
C  -2.331272 -1.086001 1.514075
C  -1.719454 2.24183 0.654403
C  -4.412003 1.795575 2.065433
C  -4.296987 2.018598 -1.009832
C  -2.172439 -2.607031 1.400228
C  -1.022334 2.275553 1.859784
C  -1.083673 2.812517 -0.452941
C  -1.469073 -3.024218 0.139234
C  0.248329 2.823825 1.971958
C  0.177133 3.371004 -0.366406
C  0.861718 3.369996 0.849058
C  -0.098431 -2.82166 0.010841
C  -2.161172 -3.577992 -0.930991
C  0.569526 -3.145855 -1.159983
C  -1.505159 -3.917161 -2.105514
C  -0.149946 -3.692732 -2.215863
C  2.887296 3.820818 2.006652
C  4.244983 4.407827 1.700255
C  2.544553 -1.877406 -0.901828
C  3.854537 -2.020917 -0.464649
C  1.955161 -0.620365 -0.957156
C  4.577064 -0.900985 -0.085383
C  2.689073 0.490319 -0.568981
C  3.998062 0.358912 -0.13059
H  -4.141404 -0.944604 0.342268
H  -2.680491 -0.682168 -0.577014
H  -2.790662 -0.864822 2.482603
H  -1.33879 -0.626127 1.539034
H  -4.589639 2.867506 2.161189
H  -5.385019 1.30221 2.028629
H  -3.921843 1.466228 2.983185
H  -3.770582 1.75214 -1.927838
H  -5.294682 1.58185 -1.077439
H  -4.415985 3.103062 -1.000575
H  -1.619283 -2.974868 2.268925
H  -3.158517 -3.076957 1.442514
H  -1.469791 1.85933 2.75566
H  -1.581304 2.82524 -1.41583
H  0.740703 2.812799 2.934581
H  0.650488 3.807585 -1.237068
H  0.463257 -2.40009 0.83682
H  -3.227196 -3.748522 -0.85086
H  -2.041611 -4.348791 -2.940077
H  2.988509 2.778131 2.331865
H  2.412241 4.375641 2.824801
H  4.745548 3.855892 0.904887
H  4.166716 5.450788 1.395132
H  4.874646 4.362895 2.588421
H  4.299624 -3.006731 -0.433184
H  0.9364 -0.496129 -1.300947
H  5.598749 -1.018711 0.251308
H  2.227376 1.466179 -0.618517
H  4.563107 1.232928 0.165729
totalener: -1510.05023576 hartree
nucrepener: 2895.61561033 hartree
electener: -4405.66584609 hartree
oneelecener: -7820.34988895 hartree
twoeener: 3414.68404286 hartree
kineticenergy: 1503.95216623 hartree
xcener: -135.235982321311 hartree
chargesum: -0.0000000
charge: 0.438840 -0.192750 -0.285857 -0.293725 -0.216606 -0.124492 -0.100494 -0.382544 -0.430186 -0.139195 -0.155585 -0.055469 0.043173 -0.171312 -0.263576 0.267546 -0.177108 -0.163758 0.163980 -0.140110 0.179736 0.015654 -0.255628 0.273774 -0.217903 -0.178045 -0.088411 -0.110974 -0.177535 0.070351 0.083636 0.082836 0.073766 0.103892 0.095373 0.081640 0.089143 0.095435 0.102991 0.095041 0.075594 0.109648 0.110656 0.104411 0.120690 0.123343 0.107361 0.120757 0.087317 0.093149 0.081681 0.090975 0.080644 0.124564 0.127034 0.122220 0.160812 0.123597
qa: 0.4388 -0.1928 -0.2859 -0.2937 -0.2166 -0.1245 -0.1005 -0.3825 -0.4302 -0.1392 -0.1556 -0.0555 0.0432 -0.1713 -0.2636 0.2675 -0.1771 -0.1638 0.1640 -0.1401 0.1797 0.0157 -0.2556 0.2738 -0.2179 -0.1780 -0.0884 -0.1110 -0.1775 0.0704 0.0836 0.0828 0.0738 0.1039 0.0954 0.0816 0.0891 0.0954 0.1030 0.0950 0.0756 0.1096 0.1107 0.1044 0.1207 0.1233 0.1074 0.1208 0.0873 0.0931 0.0817 0.0910 0.0806 0.1246 0.1270 0.1222 0.1608 0.1236
va: 4.1948 1.1051 2.0902 2.1194 3.7980 3.8662 3.7624 3.8901 3.9290 3.9044 3.9909 3.8692 3.6529 3.9445 4.0020 3.8262 3.9259 3.9155 3.7609 3.9111 4.1028 3.8432 3.9848 3.7872 4.0380 3.9421 3.9413 3.9097 3.9809 1.0179 1.0167 1.0079 1.0051 1.0104 1.0105 1.0164 1.0142 1.0146 1.0111 1.0073 1.0117 0.9962 0.9951 1.0175 1.0174 1.0104 1.0118 1.0068 0.9842 0.9883 1.0065 1.0061 1.0067 1.0142 1.0108 0.9999 0.9807 0.9997
dispcorr: -0.031192397 hartree
energy: -1510.081428157024
dipole: -12.27899 12.02750 -0.25149 24.91916 -24.31063 0.60853 20.67952 -19.48962 1.18990
magnitude: 1.35993 au
magnitude: 3.45668 debye
