program: Orca
programVersion: 5.0.2
elementType: Si F O O C C C C C C C C C C C C C C C C C C C C C C C C C H H H H H H H H H H H H H H H H H H H H H H H H H H H H H
charge: 0
multiplicity: 1
keywords: wb97x-d3
keywords: def2-TZVPP
keywords: def2/J RIJCOSX
keywords: DEFGRID2
keywords: scfconv7
keywords: smallprint printgap noloewdin
keywords: NOSOSCF
formula: C25H29FO2Si
InChI: InChI=1/C25H29FO2Si/c1-4-27-21-13-15-23(16-14-21)29(2,3)18-8-9-20-12-17-24(26)25(19-20)28-22-10-6-5-7-11-22/h5-7,10-17,19H,4,8-9,18H2,1-3H3
58 atoms
Si -3.796705 1.251869 0.764077
F  1.422261 -4.23373 0.981233
O  1.723086 3.695067 1.094035
O  1.838026 -1.678304 0.24911
C  -3.595606 -0.403812 -0.127186
C  -2.947092 -0.278455 -1.504762
C  -2.082906 2.005521 0.924739
C  -4.578814 0.954584 2.452993
C  -4.889604 2.411944 -0.244009
C  -2.492951 -1.615839 -2.094911
C  -0.964731 1.203631 1.144175
C  -1.851575 3.377682 0.785699
C  -1.45024 -2.317812 -1.265341
C  0.323448 1.718945 1.206806
C  -0.582109 3.917463 0.85636
C  0.52218 3.089399 1.059687
C  -0.260181 -1.676447 -0.929148
C  -1.651562 -3.613506 -0.80213
C  0.704087 -2.312034 -0.162665
C  -0.691935 -4.265626 -0.04205
C  0.484875 -3.615205 0.262684
C  2.885981 2.898207 1.171165
C  4.088743 3.810545 1.10543
C  2.78326 -1.296734 -0.654348
C  3.781263 -0.460479 -0.1666
C  2.799598 -1.707009 -1.980251
C  4.783606 -0.021082 -1.01326
C  3.813216 -1.25738 -2.816119
C  4.803665 -0.411278 -2.345425
H  -2.991965 -1.058285 0.51173
H  -4.567047 -0.902397 -0.21186
H  -2.090847 0.400671 -1.456736
H  -3.648212 0.187754 -2.202018
H  -4.690238 1.885256 3.010922
H  -5.569448 0.505054 2.362318
H  -3.968991 0.284424 3.060565
H  -5.869543 1.96728 -0.425325
H  -5.061786 3.359856 0.268681
H  -4.44707 2.641271 -1.214462
H  -3.358818 -2.272939 -2.210781
H  -2.101088 -1.447987 -3.102887
H  -1.077868 0.131045 1.258935
H  -2.681534 4.051368 0.605374
H  1.14852 1.036785 1.361805
H  -0.425406 4.982471 0.741884
H  -0.0751 -0.658615 -1.253621
H  -2.576037 -4.126231 -1.035375
H  -0.851312 -5.274975 0.313189
H  2.910482 2.178201 0.345032
H  2.898706 2.324418 2.106637
H  4.107327 4.372917 0.172575
H  4.097829 4.51783 1.934181
H  5.00271 3.218843 1.159635
H  3.767478 -0.170611 0.876436
H  2.038134 -2.370919 -2.367076
H  5.556345 0.631334 -0.627493
H  3.822937 -1.58023 -3.848865
H  5.586917 -0.064743 -3.00552
totalener: -1510.04946216 hartree
nucrepener: 2913.28658104 hartree
electener: -4423.33604319 hartree
oneelecener: -7855.61258460 hartree
twoeener: 3432.27654141 hartree
kineticenergy: 1503.94700810 hartree
xcener: -135.236742625684 hartree
chargesum: -0.0000000
charge: 0.432655 -0.191304 -0.287508 -0.303323 -0.260806 -0.125803 -0.114899 -0.375191 -0.424055 -0.121880 -0.165156 -0.055235 0.021390 -0.209823 -0.252292 0.339726 -0.265943 -0.112330 0.204902 -0.162333 0.203337 0.043367 -0.258032 0.318770 -0.283575 -0.181412 -0.068959 -0.120970 -0.161138 0.079376 0.081128 0.081358 0.087770 0.093547 0.089152 0.093049 0.099505 0.094222 0.104823 0.071173 0.096634 0.122513 0.103565 0.102583 0.111446 0.140871 0.108386 0.122670 0.080905 0.079660 0.087936 0.090029 0.071440 0.139214 0.128958 0.125724 0.125907 0.124275
qa: 0.4327 -0.1913 -0.2875 -0.3033 -0.2608 -0.1258 -0.1149 -0.3752 -0.4241 -0.1219 -0.1652 -0.0552 0.0214 -0.2098 -0.2523 0.3397 -0.2659 -0.1123 0.2049 -0.1623 0.2033 0.0434 -0.2580 0.3188 -0.2836 -0.1814 -0.0690 -0.1210 -0.1611 0.0794 0.0811 0.0814 0.0878 0.0935 0.0892 0.0930 0.0995 0.0942 0.1048 0.0712 0.0966 0.1225 0.1036 0.1026 0.1114 0.1409 0.1084 0.1227 0.0809 0.0797 0.0879 0.0900 0.0714 0.1392 0.1290 0.1257 0.1259 0.1243
va: 4.1853 1.1090 2.1274 2.0816 3.8406 3.8446 3.7792 3.8860 3.9025 3.8795 3.9499 3.8868 3.6886 3.9011 4.0835 3.8120 3.9175 3.9106 3.6255 3.9240 4.1415 3.8522 3.9867 3.7731 3.9840 3.9498 3.9169 3.9675 3.9972 1.0178 1.0189 1.0092 1.0091 1.0137 1.0118 1.0128 1.0117 1.0133 1.0062 1.0095 1.0026 0.9882 0.9965 1.0333 1.0198 1.0008 1.0100 1.0074 0.9895 0.9816 1.0055 1.0066 1.0083 1.0043 1.0087 0.9973 1.0001 1.0011
dispcorr: -0.031796305 hartree
energy: -1510.081258460601
dipole: -15.67787 15.50944 -0.16843 20.98797 -21.07961 -0.09164 -3.40225 2.68414 -0.71811
magnitude: 0.74327 au
magnitude: 1.88923 debye
