program: Orca
programVersion: 5.0.2
elementType: Si F O O C C C C C C C C C C C C C C C C C C C C C C C C C H H H H H H H H H H H H H H H H H H H H H H H H H H H H H
charge: 0
multiplicity: 1
keywords: wb97x-d3
keywords: def2-TZVPP
keywords: def2/J RIJCOSX
keywords: DEFGRID2
keywords: scfconv7
keywords: smallprint printgap noloewdin
keywords: NOSOSCF
formula: C25H29FO2Si
InChI: InChI=1/C25H29FO2Si/c1-4-27-21-13-15-23(16-14-21)29(2,3)18-8-9-20-12-17-24(26)25(19-20)28-22-10-6-5-7-11-22/h5-7,10-17,19H,4,8-9,18H2,1-3H3
58 atoms
Si -3.13659 1.346807 0.89273
F  1.752974 -4.424255 0.086229
O  1.814497 2.800571 -2.252105
O  2.051549 -1.795583 -0.451747
C  -3.308035 -0.534529 1.072718
C  -3.799641 -1.304359 -0.154526
C  -1.601087 1.835193 -0.067535
C  -3.008568 2.075649 2.628496
C  -4.66351 2.033175 0.024803
C  -2.786932 -1.408061 -1.299555
C  -1.63929 2.245713 -1.403812
C  -0.344537 1.772872 0.529196
C  -1.562339 -2.20582 -0.940716
C  -0.491876 2.563014 -2.104542
C  0.823836 2.0862 -0.151301
C  0.756728 2.485354 -1.484223
C  -0.310735 -1.609026 -0.841526
C  -1.663254 -3.574568 -0.69921
C  0.808625 -2.356403 -0.500797
C  -0.554478 -4.330495 -0.358538
C  0.676071 -3.712445 -0.251733
C  3.121177 2.74589 -1.71388
C  3.472867 3.963752 -0.880154
C  2.404291 -1.038132 0.618843
C  3.628335 -0.383686 0.522663
C  1.62507 -0.893498 1.759159
C  4.055564 0.433373 1.554638
C  2.069407 -0.072086 2.786473
C  3.275874 0.602771 2.691744
H  -2.357834 -0.95289 1.422351
H  -4.013481 -0.700366 1.894608
H  -4.712801 -0.843091 -0.541731
H  -4.09002 -2.316495 0.144628
H  -3.904789 1.869514 3.21601
H  -2.162022 1.66385 3.180632
H  -2.876588 3.157814 2.594299
H  -5.572236 1.776591 0.572155
H  -4.622763 3.121006 -0.047482
H  -4.781071 1.643886 -0.988115
H  -3.279059 -1.878397 -2.155642
H  -2.487755 -0.412058 -1.631872
H  -2.589143 2.319492 -1.921575
H  -0.247131 1.463972 1.563628
H  -0.545157 2.87594 -3.139517
H  1.76503 2.006156 0.37594
H  -0.194024 -0.548328 -1.033467
H  -2.625084 -4.06527 -0.786184
H  -0.636432 -5.393803 -0.176476
H  3.78005 2.690278 -2.581193
H  3.268856 1.824349 -1.141911
H  4.50859 3.892622 -0.545847
H  3.371736 4.87828 -1.463993
H  2.845251 4.057941 0.005396
H  4.234185 -0.523003 -0.363424
H  0.675271 -1.40317 1.851253
H  5.007846 0.940678 1.46959
H  1.457664 0.036396 3.672869
H  3.610885 1.242609 3.496579
totalener: -1510.04798099 hartree
nucrepener: 3026.13272457 hartree
electener: -4536.18070556 hartree
oneelecener: -8081.40080745 hartree
twoeener: 3545.22010190 hartree
kineticenergy: 1503.95277870 hartree
xcener: -135.243684029016 hartree
chargesum: 0.0000000
charge: 0.419742 -0.193522 -0.293655 -0.294943 -0.237351 -0.154308 -0.123885 -0.411113 -0.413399 -0.108200 -0.067031 -0.158577 -0.039714 -0.234546 -0.219598 0.362206 -0.101154 -0.110336 0.121937 -0.198571 0.253607 0.060908 -0.258529 0.341706 -0.251325 -0.189536 -0.110648 -0.154819 -0.130315 0.069684 0.090774 0.082372 0.086254 0.093357 0.086332 0.100516 0.103235 0.111002 0.084937 0.100081 0.076461 0.117700 0.102226 0.112581 0.090213 0.106715 0.112576 0.120397 0.100047 0.047344 0.079066 0.095221 0.090340 0.131388 0.124623 0.124822 0.129588 0.125119
qa: 0.4197 -0.1935 -0.2937 -0.2949 -0.2374 -0.1543 -0.1239 -0.4111 -0.4134 -0.1082 -0.0670 -0.1586 -0.0397 -0.2345 -0.2196 0.3622 -0.1012 -0.1103 0.1219 -0.1986 0.2536 0.0609 -0.2585 0.3417 -0.2513 -0.1895 -0.1106 -0.1548 -0.1303 0.0697 0.0908 0.0824 0.0863 0.0934 0.0863 0.1005 0.1032 0.1110 0.0849 0.1001 0.0765 0.1177 0.1022 0.1126 0.0902 0.1067 0.1126 0.1204 0.1000 0.0473 0.0791 0.0952 0.0903 0.1314 0.1246 0.1248 0.1296 0.1251
va: 4.1885 1.1052 2.1325 2.1249 3.8147 3.9001 3.6998 3.9089 3.9119 3.8180 3.8319 3.9071 3.7156 4.0833 3.8728 3.7914 3.8706 3.8938 3.7560 3.9666 4.0638 3.8829 3.9141 3.6975 3.9318 3.8511 3.8920 3.9395 3.9245 1.0245 1.0082 1.0033 1.0031 1.0130 1.0148 1.0116 1.0100 1.0108 1.0098 1.0062 1.0267 0.9927 0.9974 1.0200 1.0204 1.0137 1.0077 1.0087 0.9967 1.0169 1.0124 1.0077 1.0040 1.0139 1.0162 0.9992 0.9998 0.9998
dispcorr: -0.036482547 hartree
energy: -1510.084463534491
dipole: -17.59937 17.26259 -0.33677 24.46441 -24.07233 0.39207 5.92370 -5.59116 0.33255
magnitude: 0.61459 au
magnitude: 1.56217 debye
