program: Orca
programVersion: 5.0.2
elementType: Si F O O C C C C C C C C C C C C C C C C C C C C C C C C C H H H H H H H H H H H H H H H H H H H H H H H H H H H H H
charge: 0
multiplicity: 1
keywords: wb97x-d3
keywords: def2-TZVPP
keywords: def2/J RIJCOSX
keywords: DEFGRID2
keywords: scfconv7
keywords: smallprint printgap noloewdin
keywords: NOSOSCF
formula: C25H29FO2Si
InChI: InChI=1/C25H29FO2Si/c1-4-27-21-13-15-23(16-14-21)29(2,3)18-8-9-20-12-17-24(26)25(19-20)28-22-10-6-5-7-11-22/h5-7,10-17,19H,4,8-9,18H2,1-3H3
58 atoms
Si -4.020432 0.947627 0.986983
F  1.198318 -0.9783 -3.468109
O  1.753916 2.708103 1.029135
O  1.571647 -0.356177 -0.83391
C  -3.896471 -0.798238 0.270821
C  -3.065718 -1.7312 1.155723
C  -2.256894 1.580805 1.065743
C  -4.773378 0.906556 2.714363
C  -5.054562 2.040147 -0.147717
C  -2.417331 -2.89088 0.393579
C  -1.57638 1.786263 2.259767
C  -1.528789 1.777099 -0.114893
C  -1.440107 -2.41665 -0.648884
C  -0.2381 2.164704 2.297127
C  -0.204244 2.157805 -0.105251
C  0.458394 2.349568 1.107975
C  -0.338194 -1.648721 -0.276803
C  -1.619937 -2.695927 -1.997769
C  0.551189 -1.167496 -1.218934
C  -0.732844 -2.223084 -2.95713
C  0.341371 -1.456774 -2.562485
C  2.491633 2.871537 2.221132
C  3.910687 3.235228 1.852808
C  2.859652 -0.79065 -0.927042
C  3.838891 0.189663 -0.821556
C  3.210845 -2.124429 -1.079853
C  5.173498 -0.171068 -0.872541
C  4.554987 -2.468163 -1.131061
C  5.541402 -1.50128 -1.028868
H  -4.883498 -1.230615 0.080707
H  -3.42317 -0.696746 -0.712589
H  -3.692189 -2.135923 1.954627
H  -2.272681 -1.171153 1.661635
H  -4.783955 1.895447 3.175338
H  -5.806068 0.555803 2.677863
H  -4.230167 0.236984 3.38325
H  -6.072933 1.662373 -0.252573
H  -5.118258 3.059556 0.234877
H  -4.626171 2.097959 -1.149699
H  -1.905038 -3.545742 1.105069
H  -3.191575 -3.499573 -0.080689
H  -2.088909 1.650464 3.205326
H  -2.004086 1.620015 -1.077252
H  0.237114 2.307402 3.257955
H  0.340493 2.292835 -1.030072
H  -0.166699 -1.390558 0.76145
H  -2.470445 -3.287271 -2.313225
H  -0.880482 -2.43613 -4.007652
H  2.479862 1.94618 2.80967
H  2.047872 3.65991 2.841369
H  4.500474 3.382772 2.757123
H  4.383228 2.442625 1.273292
H  3.945971 4.157372 1.273838
H  3.537821 1.221966 -0.699172
H  2.454442 -2.895275 -1.151962
H  5.933358 0.595872 -0.794018
H  4.827282 -3.508505 -1.251338
H  6.585652 -1.778826 -1.070873
totalener: -1510.04881924 hartree
nucrepener: 2968.65460119 hartree
electener: -4478.70342043 hartree
oneelecener: -7967.07028501 hartree
twoeener: 3488.36686458 hartree
kineticenergy: 1503.96435367 hartree
xcener: -135.238550220555 hartree
chargesum: -0.0000000
charge: 0.435156 -0.195334 -0.292466 -0.280436 -0.241540 -0.113464 -0.153232 -0.416940 -0.391139 -0.124678 -0.109852 -0.037674 0.013220 -0.227932 -0.291876 0.382335 -0.131911 -0.116483 0.065256 -0.157470 0.243595 0.037022 -0.258923 0.287292 -0.239897 -0.155058 -0.089142 -0.132075 -0.149809 0.083002 0.072062 0.088046 0.064422 0.102440 0.099425 0.092438 0.090894 0.096983 0.088201 0.096013 0.071669 0.112519 0.100404 0.102630 0.111188 0.109901 0.109682 0.121748 0.082893 0.085012 0.082376 0.074168 0.089831 0.130206 0.120133 0.120970 0.122624 0.121576
qa: 0.4352 -0.1953 -0.2925 -0.2804 -0.2415 -0.1135 -0.1532 -0.4169 -0.3911 -0.1247 -0.1099 -0.0377 0.0132 -0.2279 -0.2919 0.3823 -0.1319 -0.1165 0.0653 -0.1575 0.2436 0.0370 -0.2589 0.2873 -0.2399 -0.1551 -0.0891 -0.1321 -0.1498 0.0830 0.0721 0.0880 0.0644 0.1024 0.0994 0.0924 0.0909 0.0970 0.0882 0.0960 0.0717 0.1125 0.1004 0.1026 0.1112 0.1099 0.1097 0.1217 0.0829 0.0850 0.0824 0.0742 0.0898 0.1302 0.1201 0.1210 0.1226 0.1216
va: 4.1924 1.1023 2.1059 2.0795 3.8285 3.8563 3.7943 3.9144 3.9008 3.8860 3.9467 3.8398 3.6879 3.9677 4.0552 3.7681 3.8950 3.8920 3.7568 3.9404 4.0513 3.8444 3.9776 3.8164 4.0027 3.9419 3.9406 3.9859 3.9750 1.0160 1.0182 1.0073 1.0107 1.0107 1.0135 1.0092 1.0132 1.0117 1.0151 1.0038 1.0098 0.9975 0.9996 1.0191 1.0239 1.0188 1.0103 1.0076 0.9857 0.9861 1.0094 1.0105 1.0049 1.0209 1.0143 1.0016 1.0007 1.0009
dispcorr: -0.033196327 hartree
energy: -1510.082015567027
dipole: -15.65670 15.46194 -0.19476 6.58485 -6.97071 -0.38586 20.56512 -19.80721 0.75790
magnitude: 0.87249 au
magnitude: 2.21769 debye
