program: Orca
programVersion: 5.0.2
elementType: Si F O O C C C C C C C C C C C C C C C C C C C C C C C C C H H H H H H H H H H H H H H H H H H H H H H H H H H H H H
charge: 0
multiplicity: 1
keywords: wb97x-d3
keywords: def2-TZVPP
keywords: def2/J RIJCOSX
keywords: DEFGRID2
keywords: scfconv7
keywords: smallprint printgap noloewdin
keywords: NOSOSCF
formula: C25H29FO2Si
InChI: InChI=1/C25H29FO2Si/c1-4-27-21-13-15-23(16-14-21)29(2,3)18-8-9-20-12-17-24(26)25(19-20)28-22-10-6-5-7-11-22/h5-7,10-17,19H,4,8-9,18H2,1-3H3
58 atoms
Si -3.567457 1.332524 0.077369
F  1.559583 -2.860433 1.980977
O  2.216984 2.192743 1.609904
O  2.117579 -1.832038 -0.38693
C  -3.775421 -0.479955 -0.418401
C  -3.042074 -0.855822 -1.710312
C  -1.770031 1.586656 0.568148
C  -4.694508 1.716108 1.539979
C  -3.998158 2.461707 -1.370561
C  -2.587456 -2.322264 -1.757987
C  -1.085761 0.635408 1.323979
C  -1.059795 2.744087 0.228103
C  -1.475604 -2.572284 -0.777826
C  0.235602 0.80522 1.71694
C  0.255895 2.934352 0.603395
C  0.92464 1.95563 1.340351
C  -0.18998 -2.131334 -1.084794
C  -1.704642 -3.150403 0.46331
C  0.838053 -2.213044 -0.160637
C  -0.67898 -3.260713 1.393935
C  0.572409 -2.782044 1.082123
C  3.014079 1.149599 2.138221
C  4.458511 1.58451 2.057751
C  2.448505 -0.794001 -1.211744
C  1.643909 0.319332 -1.417583
C  3.708795 -0.868204 -1.791882
C  2.117113 1.357676 -2.206114
C  4.166516 0.178228 -2.575154
C  3.373472 1.296708 -2.788636
H  -3.398936 -1.077315 0.41892
H  -4.835724 -0.737317 -0.499587
H  -2.156602 -0.226836 -1.85335
H  -3.68973 -0.651954 -2.566429
H  -5.746949 1.572358 1.288717
H  -4.469788 1.074903 2.393692
H  -4.573395 2.747906 1.872681
H  -3.917209 3.517892 -1.108484
H  -3.349299 2.286133 -2.229947
H  -5.025783 2.293928 -1.698079
H  -3.435342 -2.979237 -1.548178
H  -2.248809 -2.563614 -2.769006
H  -1.577388 -0.286162 1.616381
H  -1.539377 3.520705 -0.357015
H  0.715101 0.025597 2.293438
H  0.791784 3.829356 0.31367
H  0.004056 -1.703719 -2.060967
H  -2.692064 -3.515674 0.715071
H  -0.849724 -3.709178 2.363684
H  2.867673 0.227014 1.565801
H  2.730383 0.940524 3.177125
H  5.101586 0.80641 2.468497
H  4.754856 1.755381 1.022878
H  4.632145 2.499547 2.624183
H  0.666314 0.397506 -0.961777
H  4.324158 -1.740911 -1.616872
H  1.489538 2.227383 -2.348553
H  5.150141 0.115856 -3.022006
H  3.733433 2.113678 -3.39911
totalener: -1510.04874451 hartree
nucrepener: 3064.39758706 hartree
electener: -4574.44633157 hartree
oneelecener: -8158.09560225 hartree
twoeener: 3583.64927068 hartree
kineticenergy: 1503.94203426 hartree
xcener: -135.241226395630 hartree
chargesum: 0.0000000
charge: 0.420727 -0.200411 -0.282705 -0.293722 -0.265476 -0.118280 -0.149847 -0.376560 -0.415140 -0.124783 -0.106747 0.000715 0.122261 -0.234311 -0.327838 0.348921 -0.232274 -0.264688 0.250873 -0.082637 0.101632 0.033363 -0.254767 0.267297 -0.134832 -0.223308 -0.130504 -0.099100 -0.138126 0.066226 0.089608 0.064234 0.088895 0.089413 0.091790 0.094668 0.094099 0.103343 0.100454 0.077170 0.091379 0.108351 0.107308 0.115636 0.112474 0.134381 0.118940 0.122637 0.074302 0.095776 0.079276 0.085805 0.086670 0.119813 0.125305 0.123704 0.123944 0.124666
qa: 0.4207 -0.2004 -0.2827 -0.2937 -0.2655 -0.1183 -0.1498 -0.3766 -0.4151 -0.1248 -0.1067 0.0007 0.1223 -0.2343 -0.3278 0.3489 -0.2323 -0.2647 0.2509 -0.0826 0.1016 0.0334 -0.2548 0.2673 -0.1348 -0.2233 -0.1305 -0.0991 -0.1381 0.0662 0.0896 0.0642 0.0889 0.0894 0.0918 0.0947 0.0941 0.1033 0.1005 0.0772 0.0914 0.1084 0.1073 0.1156 0.1125 0.1344 0.1189 0.1226 0.0743 0.0958 0.0793 0.0858 0.0867 0.1198 0.1253 0.1237 0.1239 0.1247
va: 4.1803 1.0883 2.1076 2.0923 3.8355 3.8757 3.7841 3.8944 3.9073 3.9046 3.8745 3.7683 3.5726 3.8567 4.0477 3.7601 3.9501 3.9537 3.6830 3.8675 4.0461 3.8446 3.9772 3.6931 3.8514 4.0296 3.9888 3.9388 3.9734 1.0252 1.0161 1.0054 1.0089 1.0126 1.0137 1.0142 1.0133 1.0072 1.0127 1.0099 1.0085 0.9900 0.9941 1.0152 1.0217 1.0050 1.0095 1.0061 0.9883 0.9893 1.0076 1.0065 1.0064 0.9909 1.0152 1.0056 0.9992 1.0002
dispcorr: -0.037479661 hartree
energy: -1510.086224172986
dipole: -16.85815 16.49028 -0.36787 14.98472 -15.03522 -0.05050 -5.33080 4.92054 -0.41026
magnitude: 0.55335 au
magnitude: 1.40651 debye
