program: Orca
programVersion: 5.0.2
elementType: O O O C C C C C C C C C C C C C C C C C C C C C C H H H H H H H H H H H H H H H H H H H H H H H H H H
charge: 0
multiplicity: 1
keywords: wb97x-d3
keywords: def2-TZVPP
keywords: def2/J RIJCOSX
keywords: DEFGRID2
keywords: scfconv7
keywords: smallprint printgap noloewdin
keywords: NOSOSCF
formula: C22H26O3
InChI: InChI=1/C22H26O3/c1-15(2)10-19-20(22(19,3)4)21(23)25-14-17-12-18(24-13-17)11-16-8-6-5-7-9-16/h5-10,12-13,19-20H,11,14H2,1-4H3
51 atoms
O  2.056427 1.461899 0.261408
O  4.138439 2.217492 0.018156
O  -1.99131 2.207048 -0.741662
C  3.102069 -1.313711 0.562505
C  2.91073 -1.107684 -0.904474
C  3.751872 -0.112925 -0.107938
C  1.963762 -1.171121 1.545327
C  4.082641 -2.3877 0.975252
C  1.628238 -0.707673 -1.541726
C  3.350738 1.294109 0.068658
C  0.512704 -1.440643 -1.568435
C  -0.723619 -0.942873 -2.254438
C  0.382826 -2.790072 -0.934272
C  1.484421 2.78005 0.226242
C  0.020608 2.560356 0.125292
C  -0.862517 2.118546 1.16211
C  -0.721239 2.590406 -1.004979
C  -2.067827 1.915387 0.582694
C  -3.349336 1.364352 1.09228
C  -3.480261 -0.101813 0.752055
C  -4.277977 -0.527248 -0.303823
C  -2.759602 -1.049283 1.475246
C  -4.358747 -1.876243 -0.629637
C  -2.841362 -2.395907 1.155388
C  -3.641124 -2.813691 0.098271
H  3.534076 -1.741908 -1.531128
H  4.822632 -0.196806 -0.2513
H  1.608815 -2.165014 1.822277
H  2.299345 -0.683193 2.462162
H  1.10877 -0.621884 1.162085
H  4.494111 -2.180908 1.964888
H  3.58629 -3.359173 1.019809
H  4.916708 -2.471922 0.277894
H  1.622931 0.239447 -2.073811
H  -1.054368 -1.639045 -3.029113
H  -0.573286 0.031869 -2.717528
H  -1.552481 -0.857703 -1.545625
H  0.07236 -3.527733 -1.678862
H  -0.395727 -2.785688 -0.16752
H  1.305891 -3.144297 -0.479551
H  1.859794 3.332962 -0.635988
H  1.755024 3.324877 1.131958
H  -0.621596 1.963001 2.202002
H  -0.492876 2.859969 -2.024256
H  -4.194274 1.92321 0.684561
H  -3.36765 1.498416 2.174565
H  -4.844082 0.198943 -0.874508
H  -2.13086 -0.729063 2.298122
H  -4.983971 -2.19318 -1.454124
H  -2.280836 -3.12063 1.731535
H  -3.704848 -3.864161 -0.153075
elementType: O C H
totalener: -1079.73407318 hartree
nucrepener: 2266.00011942 hartree
electener: -3345.73419261 hartree
oneelecener: -5970.96447968 hartree
twoeener: 2625.23028708 hartree
cpcmener: -0.03297350 hartree
kineticenergy: 1074.88572699 hartree
xcener: -106.470156069151 hartree
chargesum: 0.0000000
charge: -0.252156 -0.514365 -0.280673 0.077997 0.011211 -0.095572 -0.253453 -0.275734 -0.275766 0.408122 -0.001739 -0.205616 -0.286212 0.078788 -0.066429 -0.342921 -0.056688 0.211729 -0.050560 0.043046 -0.177328 -0.196642 -0.156689 -0.177032 -0.169482 0.112285 0.092198 0.095099 0.116268 0.063888 0.099239 0.091656 0.088324 0.117461 0.114273 0.096403 0.033577 0.111497 0.099240 0.100577 0.111204 0.120928 0.163757 0.181240 0.110423 0.116750 0.140632 0.144684 0.158634 0.163152 0.160772
qa: -0.2522 -0.5144 -0.2807 0.0780 0.0112 -0.0956 -0.2535 -0.2757 -0.2758 0.4081 -0.0017 -0.2056 -0.2862 0.0788 -0.0664 -0.3429 -0.0567 0.2117 -0.0506 0.0430 -0.1773 -0.1966 -0.1567 -0.1770 -0.1695 0.1123 0.0922 0.0951 0.1163 0.0639 0.0992 0.0917 0.0883 0.1175 0.1143 0.0964 0.0336 0.1115 0.0992 0.1006 0.1112 0.1209 0.1638 0.1812 0.1104 0.1167 0.1406 0.1447 0.1586 0.1632 0.1608
va: 2.1034 1.9849 2.2509 3.7075 3.7830 3.8816 3.8750 3.9151 3.8577 4.1181 3.6105 3.9146 3.9426 3.8565 3.6985 3.9709 3.9095 3.5996 3.8127 3.5688 3.8980 3.8746 3.8705 3.8649 3.8566 1.0055 1.0267 1.0000 1.0035 1.0085 1.0003 1.0032 1.0055 1.0111 1.0004 1.0093 1.0163 1.0004 0.9993 1.0076 1.0049 0.9923 1.0061 0.9930 1.0127 1.0079 1.0044 1.0027 0.9902 0.9898 0.9898
dispcorr: -0.031010771 hartree
energy: -1079.765083954356
dipole: 2.73127 -4.12048 -1.38921 -18.63907 17.47999 -1.15908 0.30427 0.03649 0.34076
magnitude: 1.84105 au
magnitude: 4.67959 debye
