program: Orca
programVersion: 5.0.2
elementType: O O O C C C C C C C C C C C C C C C C C C C C C C H H H H H H H H H H H H H H H H H H H H H H H H H H
charge: 0
multiplicity: 1
keywords: wb97x-d3
keywords: def2-TZVPP
keywords: def2/J RIJCOSX
keywords: DEFGRID2
keywords: scfconv7
keywords: smallprint printgap noloewdin
keywords: NOSOSCF
formula: C22H26O3
InChI: InChI=1/C22H26O3/c1-15(2)10-19-20(22(19,3)4)21(23)25-14-17-12-18(24-13-17)11-16-8-6-5-7-9-16/h5-10,12-13,19-20H,11,14H2,1-4H3
51 atoms
O  2.409397 2.179819 -0.238966
O  1.695251 0.72294 1.293186
O  -1.670727 1.705797 -1.30014
C  4.066933 -1.075676 0.473753
C  3.035588 -1.336492 -0.568394
C  3.44165 0.109183 -0.232796
C  3.804397 -1.363214 1.931815
C  5.504156 -1.337716 0.086311
C  1.676361 -1.840465 -0.258633
C  2.439623 0.992518 0.37833
C  0.645485 -1.791561 -1.107108
C  -0.699395 -2.33052 -0.731969
C  0.732322 -1.197652 -2.479975
C  1.38848 3.096995 0.170525
C  0.025671 2.606313 -0.18573
C  -1.118742 2.547294 0.670327
C  -0.371766 2.084732 -1.36935
C  -2.120892 1.997215 -0.054591
C  -3.520857 1.629269 0.277084
C  -3.693312 0.138673 0.451377
C  -3.222106 -0.489803 1.602258
C  -4.301828 -0.632071 -0.53296
C  -3.368497 -1.858464 1.770978
C  -4.446247 -2.004848 -0.368735
C  -3.982201 -2.621263 0.784272
H  3.424663 -1.645176 -1.534128
H  4.062873 0.594278 -0.976317
H  4.368344 -0.675221 2.563996
H  2.760998 -1.298554 2.22333
H  4.146013 -2.373361 2.164631
H  6.186315 -0.736971 0.690702
H  5.75678 -2.387781 0.244788
H  5.693302 -1.104815 -0.962122
H  1.518539 -2.292979 0.715093
H  -1.444578 -1.530249 -0.742626
H  -0.700723 -2.782412 0.259235
H  -1.042833 -3.080315 -1.449302
H  1.613375 -0.574695 -2.625552
H  -0.149517 -0.590432 -2.69331
H  0.752486 -1.984257 -3.239624
H  1.631433 4.022924 -0.349123
H  1.454452 3.295214 1.241817
H  -1.177047 2.869726 1.69825
H  0.132694 1.922582 -2.308825
H  -4.199494 1.993072 -0.49838
H  -3.789185 2.145355 1.200207
H  -2.740333 0.099778 2.374043
H  -4.672329 -0.155895 -1.432998
H  -3.002088 -2.331709 2.672906
H  -4.923766 -2.59144 -1.143075
H  -4.096354 -3.689518 0.915039
elementType: O C H
totalener: -1079.73650202 hartree
nucrepener: 2242.36814738 hartree
electener: -3322.10464941 hartree
oneelecener: -5925.33966774 hartree
twoeener: 2603.23501834 hartree
cpcmener: -0.03319265 hartree
kineticenergy: 1074.87570959 hartree
xcener: -106.469295118519 hartree
chargesum: 0.0000000
charge: -0.296439 -0.491148 -0.285365 0.141253 -0.034932 -0.088712 -0.297874 -0.264834 -0.251187 0.385541 -0.022310 -0.201267 -0.298308 0.107891 -0.034705 -0.336352 -0.074410 0.199340 -0.055588 0.023215 -0.167726 -0.165859 -0.198373 -0.175932 -0.149035 0.114210 0.093768 0.103389 0.089717 0.098495 0.095205 0.095042 0.088159 0.127010 0.051915 0.095469 0.103570 0.098510 0.090481 0.120406 0.119425 0.118590 0.163657 0.176229 0.111144 0.117585 0.143840 0.141261 0.158819 0.157958 0.159260
qa: -0.2964 -0.4911 -0.2854 0.1413 -0.0349 -0.0887 -0.2979 -0.2648 -0.2512 0.3855 -0.0223 -0.2013 -0.2983 0.1079 -0.0347 -0.3364 -0.0744 0.1993 -0.0556 0.0232 -0.1677 -0.1659 -0.1984 -0.1759 -0.1490 0.1142 0.0938 0.1034 0.0897 0.0985 0.0952 0.0950 0.0882 0.1270 0.0519 0.0955 0.1036 0.0985 0.0905 0.1204 0.1194 0.1186 0.1637 0.1762 0.1111 0.1176 0.1438 0.1413 0.1588 0.1580 0.1593
va: 2.1141 1.9901 2.2466 3.7602 3.8050 3.8311 3.8907 3.8962 3.8269 4.1148 3.7062 3.9265 3.9524 3.8158 3.6019 4.0086 3.9229 3.6228 3.8081 3.5980 3.8756 3.8910 3.8894 3.8803 3.8301 1.0029 1.0305 0.9995 1.0197 0.9993 1.0025 1.0020 1.0041 1.0014 1.0022 1.0036 0.9975 1.0017 0.9970 0.9979 0.9944 1.0063 1.0046 0.9933 1.0096 1.0072 1.0032 1.0036 0.9924 0.9917 0.9903
dispcorr: -0.028628232 hartree
energy: -1079.765130253138
dipole: 10.77463 -10.39396 0.38067 -14.07858 14.38377 0.30519 -1.19041 0.51871 -0.67170
magnitude: 0.83020 au
magnitude: 2.11021 debye
