program: Orca
programVersion: 5.0.2
elementType: O O O C C C C C C C C C C C C C C C C C C C C C C H H H H H H H H H H H H H H H H H H H H H H H H H H
charge: 0
multiplicity: 1
keywords: wb97x-d3
keywords: def2-TZVPP
keywords: def2/J RIJCOSX
keywords: DEFGRID2
keywords: scfconv7
keywords: smallprint printgap noloewdin
keywords: NOSOSCF
formula: C22H26O3
InChI: InChI=1/C22H26O3/c1-15(2)10-19-20(22(19,3)4)21(23)25-14-17-12-18(24-13-17)11-16-8-6-5-7-9-16/h5-10,12-13,19-20H,11,14H2,1-4H3
51 atoms
O  1.588872 1.43832 -1.410797
O  2.76585 1.485908 0.488903
O  -1.334267 1.652496 1.827406
C  4.297827 -0.979522 -0.600337
C  3.054217 -1.533228 -0.0018
C  2.970303 -0.373596 -1.011438
C  5.294742 -0.215202 0.235495
C  4.958893 -1.803068 -1.681553
C  2.681236 -1.340134 1.419074
C  2.472921 0.928208 -0.545145
C  1.422448 -1.399788 1.861577
C  1.079466 -1.168469 3.299543
C  0.264887 -1.638478 0.935812
C  0.822432 2.57924 -0.984403
C  -0.244836 2.154107 -0.039946
C  -1.458804 1.468716 -0.375604
C  -0.22567 2.230336 1.310558
C  -2.080091 1.184896 0.792783
C  -3.342494 0.476362 1.138282
C  -3.931128 -0.207148 -0.064941
C  -4.96483 0.381705 -0.785089
C  -3.425533 -1.4323 -0.494594
C  -5.489378 -0.24249 -1.910307
C  -3.945778 -2.05773 -1.618091
C  -4.980863 -1.463553 -2.32999
H  2.70134 -2.463655 -0.440503
H  2.617743 -0.651627 -1.99758
H  4.859826 0.323236 1.071888
H  6.031067 -0.911174 0.642151
H  5.83457 0.506486 -0.379944
H  4.229634 -2.352202 -2.278437
H  5.535744 -1.169806 -2.357881
H  5.643565 -2.531014 -1.242011
H  3.477485 -1.138481 2.128885
H  0.399879 -0.317021 3.397596
H  1.960898 -0.968385 3.90847
H  0.556973 -2.028712 3.725362
H  -0.634504 -1.920661 1.484074
H  0.469326 -2.424444 0.207066
H  0.024988 -0.737051 0.365722
H  0.395846 2.980845 -1.901615
H  1.467087 3.344106 -0.551161
H  -1.805906 1.218601 -1.365913
H  0.475103 2.650097 2.01491
H  -4.064687 1.182343 1.559445
H  -3.136763 -0.259137 1.921821
H  -5.366735 1.334698 -0.46202
H  -2.619794 -1.902134 0.058235
H  -6.29679 0.226355 -2.457916
H  -3.544878 -3.01125 -1.936942
H  -5.389197 -1.952025 -3.20519
elementType: O C H
totalener: -1079.73666137 hartree
nucrepener: 2209.96417632 hartree
electener: -3289.70083768 hartree
oneelecener: -5859.48280784 hartree
twoeener: 2569.78197015 hartree
cpcmener: -0.02943990 hartree
kineticenergy: 1074.85773915 hartree
xcener: -106.465319053822 hartree
chargesum: -0.0000000
charge: -0.298306 -0.493104 -0.288838 0.128059 -0.014968 -0.082271 -0.296323 -0.266127 -0.272738 0.383460 -0.007802 -0.221094 -0.292053 0.087117 -0.072418 -0.291269 -0.031907 0.162137 -0.009508 0.000188 -0.177005 -0.200596 -0.163340 -0.173064 -0.165262 0.114107 0.091350 0.090834 0.098813 0.102094 0.087820 0.095883 0.094744 0.126800 0.090589 0.089007 0.099103 0.108339 0.115936 0.077121 0.121714 0.118699 0.156212 0.172594 0.107101 0.114189 0.140794 0.163500 0.159914 0.158902 0.160874
qa: -0.2983 -0.4931 -0.2888 0.1281 -0.0150 -0.0823 -0.2963 -0.2661 -0.2727 0.3835 -0.0078 -0.2211 -0.2921 0.0871 -0.0724 -0.2913 -0.0319 0.1621 -0.0095 0.0002 -0.1770 -0.2006 -0.1633 -0.1731 -0.1653 0.1141 0.0913 0.0908 0.0988 0.1021 0.0878 0.0959 0.0947 0.1268 0.0906 0.0890 0.0991 0.1083 0.1159 0.0771 0.1217 0.1187 0.1562 0.1726 0.1071 0.1142 0.1408 0.1635 0.1599 0.1589 0.1609
va: 2.0985 1.9874 2.2426 3.7695 3.7990 3.8354 3.8880 3.8976 3.8109 4.1079 3.6907 3.9138 3.9678 3.8337 3.6222 3.9251 3.9142 3.6278 3.8035 3.6166 3.9270 3.9054 3.8923 3.9293 3.8855 1.0064 1.0324 1.0184 0.9987 0.9999 1.0045 1.0024 1.0022 0.9981 1.0010 1.0083 0.9964 1.0013 1.0019 0.9972 0.9926 1.0108 1.0055 1.0031 1.0081 1.0044 1.0040 0.9906 0.9898 0.9921 0.9891
dispcorr: -0.028178094 hartree
energy: -1079.764839460927
dipole: 12.65357 -13.36189 -0.70832 -12.58500 11.91946 -0.66555 1.87657 -2.71481 -0.83825
magnitude: 1.28348 au
magnitude: 3.26235 debye
