program: Orca
programVersion: 5.0.2
elementType: O O O C C C C C C C C C C C C C C C C C C C C C C H H H H H H H H H H H H H H H H H H H H H H H H H H
charge: 0
multiplicity: 1
keywords: wb97x-d3
keywords: def2-TZVPP
keywords: def2/J RIJCOSX
keywords: DEFGRID2
keywords: scfconv7
keywords: smallprint printgap noloewdin
keywords: NOSOSCF
formula: C22H26O3
InChI: InChI=1/C22H26O3/c1-15(2)10-19-20(22(19,3)4)21(23)25-14-17-12-18(24-13-17)11-16-8-6-5-7-9-16/h5-10,12-13,19-20H,11,14H2,1-4H3
51 atoms
O  2.28128 1.574597 0.261185
O  2.213169 2.042493 -1.921555
O  -1.873358 1.937349 1.355841
C  3.468215 -1.112784 -0.293956
C  2.064878 -1.316563 -0.771267
C  2.872977 -0.122287 -1.274295
C  3.763196 -0.772773 1.146914
C  4.520934 -2.015763 -0.896706
C  0.860849 -1.140733 0.084107
C  2.431866 1.262418 -1.017649
C  0.486527 -1.984404 1.049488
C  -0.773551 -1.764667 1.82827
C  1.26803 -3.201001 1.436816
C  1.599122 2.795057 0.612619
C  0.132985 2.551757 0.628156
C  -0.761678 2.458739 -0.488753
C  -0.602402 2.22394 1.715692
C  -1.960393 2.074851 0.007159
C  -3.236077 1.67406 -0.638455
C  -3.379165 0.169091 -0.624531
C  -2.570764 -0.612814 -1.447172
C  -4.265698 -0.462264 0.240453
C  -2.646192 -1.996815 -1.406041
C  -4.346023 -1.849453 0.282327
C  -3.534799 -2.62035 -0.537952
H  1.95573 -2.081838 -1.536508
H  3.224122 -0.224235 -2.294664
H  4.613947 -0.093586 1.223259
H  2.925718 -0.332013 1.678603
H  4.035777 -1.688341 1.675344
H  4.304814 -2.257756 -1.938116
H  5.50668 -1.548144 -0.859825
H  4.578235 -2.954468 -0.341684
H  0.207989 -0.301505 -0.138065
H  -1.445284 -2.621938 1.738356
H  -1.313292 -0.875955 1.501777
H  -0.555666 -1.654692 2.894018
H  0.6523 -4.098179 1.332108
H  1.56292 -3.154075 2.488059
H  2.1674 -3.342571 0.84007
H  1.880997 3.604615 -0.059471
H  1.960632 3.040946 1.609362
H  -0.537384 2.639826 -1.527698
H  -0.365199 2.158045 2.766201
H  -3.225001 2.043569 -1.66492
H  -4.088423 2.138943 -0.13779
H  -1.869602 -0.132932 -2.120526
H  -4.899588 0.133331 0.886596
H  -2.009973 -2.589958 -2.050296
H  -5.040484 -2.326981 0.961538
H  -3.59247 -3.70047 -0.50224
elementType: O C H
totalener: -1079.73400990 hartree
nucrepener: 2281.10619099 hartree
electener: -3360.84020089 hartree
oneelecener: -6001.71501281 hartree
twoeener: 2640.87481192 hartree
cpcmener: -0.03031711 hartree
kineticenergy: 1074.86103514 hartree
xcener: -106.466696352704 hartree
chargesum: -0.0000000
charge: -0.264749 -0.506221 -0.280499 0.106170 -0.006588 -0.116742 -0.285773 -0.275654 -0.249109 0.419993 -0.000453 -0.265386 -0.269492 0.050950 -0.062279 -0.296649 -0.047955 0.188834 -0.034599 0.035790 -0.210259 -0.175386 -0.162594 -0.154048 -0.175244 0.109855 0.094877 0.110992 0.094249 0.094174 0.088508 0.098710 0.091827 0.102594 0.105826 0.064041 0.116354 0.108985 0.101915 0.090895 0.124400 0.115669 0.157880 0.178089 0.115845 0.108424 0.147390 0.140632 0.157613 0.159000 0.159202
qa: -0.2647 -0.5062 -0.2805 0.1062 -0.0066 -0.1167 -0.2858 -0.2757 -0.2491 0.4200 -0.0005 -0.2654 -0.2695 0.0509 -0.0623 -0.2966 -0.0480 0.1888 -0.0346 0.0358 -0.2103 -0.1754 -0.1626 -0.1540 -0.1752 0.1099 0.0949 0.1110 0.0942 0.0942 0.0885 0.0987 0.0918 0.1026 0.1058 0.0640 0.1164 0.1090 0.1019 0.0909 0.1244 0.1157 0.1579 0.1781 0.1158 0.1084 0.1474 0.1406 0.1576 0.1590 0.1592
va: 2.1150 1.9852 2.2569 3.6793 3.7703 3.8796 3.8721 3.9056 3.8386 4.1259 3.5817 3.9411 3.9314 3.8463 3.6118 3.9766 3.9221 3.6593 3.8073 3.5699 3.8588 3.9160 3.8384 3.8685 3.8371 1.0069 1.0266 1.0044 1.0114 0.9980 1.0050 1.0011 1.0036 0.9811 0.9951 1.0061 1.0017 1.0004 0.9952 1.0063 1.0083 1.0013 1.0191 0.9927 1.0087 1.0119 1.0017 1.0041 0.9927 0.9900 0.9906
dispcorr: -0.031489548 hartree
energy: -1079.765499443410
dipole: 10.20981 -10.26271 -0.05290 -18.83519 17.86466 -0.97053 6.22248 -5.12771 1.09478
magnitude: 1.46399 au
magnitude: 3.72116 debye
