program: Orca
programVersion: 5.0.2
elementType: O O O C C C C C C C C C C C C C C C C C C C C C C H H H H H H H H H H H H H H H H H H H H H H H H H H
charge: 0
multiplicity: 1
keywords: wb97x-d3
keywords: def2-TZVPP
keywords: def2/J RIJCOSX
keywords: DEFGRID2
keywords: scfconv7
keywords: smallprint printgap noloewdin
keywords: NOSOSCF
formula: C22H26O3
InChI: InChI=1/C22H26O3/c1-15(2)10-19-20(22(19,3)4)21(23)25-14-17-12-18(24-13-17)11-16-8-6-5-7-9-16/h5-10,12-13,19-20H,11,14H2,1-4H3
51 atoms
O  2.052952 1.740357 -1.005604
O  2.669624 1.218988 1.082041
O  -2.342355 2.313244 -0.461168
C  4.530429 -0.897407 -0.24113
C  3.214189 -1.567444 -0.070125
C  3.289107 -0.192066 -0.755421
C  5.300073 -0.377307 0.947459
C  5.432691 -1.429738 -1.330261
C  2.556068 -1.749196 1.243698
C  2.670174 0.969467 -0.103291
C  1.248557 -1.989187 1.376197
C  0.616995 -2.20762 2.714968
C  0.329518 -2.04935 0.188325
C  1.274968 2.854284 -0.540677
C  -0.130833 2.444137 -0.2803
C  -0.623746 1.483831 0.66551
C  -1.221688 2.904885 -0.933997
C  -1.966184 1.439426 0.508175
C  -3.027651 0.629706 1.154451
C  -3.855555 -0.16829 0.174167
C  -3.253662 -0.88406 -0.859425
C  -5.239687 -0.219507 0.302964
C  -4.018711 -1.638483 -1.736775
C  -6.00865 -0.974933 -0.573633
C  -5.400277 -1.68661 -1.59763
H  2.995911 -2.350833 -0.791577
H  3.160988 -0.211136 -1.830984
H  5.952316 0.444485 0.647104
H  4.677768 -0.024005 1.764181
H  5.937307 -1.171616 1.3407
H  4.863103 -1.814614 -2.176879
H  6.100174 -0.650183 -1.701734
H  6.051719 -2.244032 -0.948633
H  3.176619 -1.709368 2.133444
H  1.342434 -2.162259 3.527004
H  0.116594 -3.178374 2.760779
H  -0.15483 -1.45602 2.904501
H  0.495073 -2.956655 -0.399167
H  0.475081 -1.204957 -0.488533
H  -0.716767 -2.05287 0.494667
H  1.308245 3.58774 -1.344912
H  1.737357 3.303886 0.338231
H  -0.056376 0.893474 1.367455
H  -1.348384 3.628227 -1.724582
H  -3.688016 1.269029 1.747063
H  -2.536476 -0.042134 1.863263
H  -2.177163 -0.854638 -0.982807
H  -5.722528 0.335991 1.098318
H  -3.534604 -2.187837 -2.53395
H  -7.084426 -1.002388 -0.457261
H  -5.997136 -2.271674 -2.285142
elementType: O C H
totalener: -1079.73676957 hartree
nucrepener: 2179.03185261 hartree
electener: -3258.76862219 hartree
oneelecener: -5797.43928635 hartree
twoeener: 2538.67066416 hartree
cpcmener: -0.03089016 hartree
kineticenergy: 1074.85021838 hartree
xcener: -106.463050643376 hartree
chargesum: -0.0000000
charge: -0.296929 -0.499630 -0.292006 0.130112 -0.023101 -0.097396 -0.297487 -0.264313 -0.268907 0.414191 -0.018039 -0.212961 -0.316159 0.077828 -0.061162 -0.345303 -0.041150 0.227688 -0.069174 0.069402 -0.240889 -0.175355 -0.174675 -0.156552 -0.174386 0.115587 0.093534 0.101385 0.092416 0.100783 0.088085 0.096527 0.094742 0.127696 0.088801 0.104846 0.087625 0.121803 0.099023 0.103735 0.118387 0.117067 0.172172 0.178337 0.109680 0.117459 0.156020 0.142311 0.158548 0.159889 0.159894
qa: -0.2969 -0.4996 -0.2920 0.1301 -0.0231 -0.0974 -0.2975 -0.2643 -0.2689 0.4142 -0.0180 -0.2130 -0.3162 0.0778 -0.0612 -0.3453 -0.0412 0.2277 -0.0692 0.0694 -0.2409 -0.1754 -0.1747 -0.1566 -0.1744 0.1156 0.0935 0.1014 0.0924 0.1008 0.0881 0.0965 0.0947 0.1277 0.0888 0.1048 0.0876 0.1218 0.0990 0.1037 0.1184 0.1171 0.1722 0.1783 0.1097 0.1175 0.1560 0.1423 0.1585 0.1599 0.1599
va: 2.1030 1.9790 2.2652 3.7680 3.7928 3.8559 3.8923 3.8954 3.8037 4.0677 3.6726 3.9106 3.9656 3.8509 3.6861 3.9832 3.9681 3.6092 3.8319 3.5530 3.9370 3.9285 3.9331 3.8868 3.8970 1.0015 1.0330 1.0001 1.0180 0.9982 1.0047 1.0023 1.0021 0.9996 1.0090 0.9941 0.9943 1.0002 0.9932 0.9966 0.9980 1.0106 1.0095 0.9935 1.0089 1.0021 0.9933 1.0022 0.9917 0.9899 0.9896
dispcorr: -0.026944476 hartree
energy: -1079.763714050507
dipole: 14.30532 -14.38967 -0.08435 -15.32968 14.81685 -0.51284 3.95810 -4.66901 -0.71091
magnitude: 0.88063 au
magnitude: 2.23838 debye
