program: Orca
programVersion: 5.0.2
elementType: O O O C C C C C C C C C C C C C C C C C C C C C C H H H H H H H H H H H H H H H H H H H H H H H H H H
charge: 0
multiplicity: 1
keywords: wb97x-d3
keywords: def2-TZVPP
keywords: def2/J RIJCOSX
keywords: DEFGRID2
keywords: scfconv7
keywords: smallprint printgap noloewdin
keywords: NOSOSCF
formula: C22H26O3
InChI: InChI=1/C22H26O3/c1-15(2)10-19-20(22(19,3)4)21(23)25-14-17-12-18(24-13-17)11-16-8-6-5-7-9-16/h5-10,12-13,19-20H,11,14H2,1-4H3
51 atoms
O  1.056267 0.497314 0.291788
O  3.158784 1.170897 0.60958
O  -3.08943 1.712161 0.946712
C  3.868681 -1.242895 -1.260963
C  3.940097 -1.774307 0.128188
C  2.702184 -0.999049 -0.317307
C  4.766314 -0.110138 -1.693952
C  3.585925 -2.228163 -2.370386
C  4.908657 -1.25747 1.128361
C  2.378479 0.32547 0.239399
C  4.681855 -1.14326 2.438826
C  5.740544 -0.64376 3.372978
C  3.367417 -1.465606 3.07938
C  0.565357 1.739034 0.819689
C  -0.900243 1.764471 0.593901
C  -1.580094 1.916667 -0.658056
C  -1.873027 1.643662 1.525789
C  -2.904683 1.878199 -0.38479
C  -4.115882 1.938525 -1.241147
C  -4.836894 0.612527 -1.302725
C  -6.076735 0.439618 -0.698725
C  -4.253911 -0.468345 -1.960989
C  -6.727156 -0.787504 -0.755775
C  -4.8999 -1.6934 -2.020274
C  -6.140935 -1.856906 -1.416094
H  3.729539 -2.837685 0.219535
H  1.828152 -1.609908 -0.510866
H  5.696907 -0.51628 -2.099537
H  4.29269 0.471775 -2.487764
H  5.033022 0.576881 -0.894223
H  4.513863 -2.678651 -2.730003
H  2.933112 -3.037653 -2.039948
H  3.104653 -1.738338 -3.219386
H  5.891016 -0.985984 0.751481
H  5.978123 -1.388387 4.137338
H  5.400467 0.247986 3.906827
H  6.664075 -0.390259 2.852106
H  2.651269 -1.914636 2.393498
H  2.910679 -0.563322 3.496246
H  3.501873 -2.154561 3.917589
H  1.048468 2.577274 0.312909
H  0.797934 1.809625 1.885214
H  -1.13295 2.040378 -1.632428
H  -1.847712 1.517075 2.597421
H  -3.800046 2.239403 -2.241989
H  -4.795859 2.715307 -0.881212
H  -6.541911 1.271151 -0.182291
H  -3.285009 -0.349282 -2.432926
H  -7.693807 -0.905733 -0.282577
H  -4.435813 -2.522285 -2.539775
H  -6.647159 -2.812704 -1.461932
elementType: O C H
totalener: -1079.75190357 hartree
nucrepener: 2057.81336276 hartree
electener: -3137.56526633 hartree
oneelecener: -5554.95172695 hartree
twoeener: 2417.38646062 hartree
cpcmener: -0.02726331 hartree
kineticenergy: 1074.85760674 hartree
xcener: -106.459053395349 hartree
chargesum: -0.0000000
charge: -0.281158 -0.469709 -0.278063 0.128761 -0.015512 -0.092234 -0.298478 -0.264053 -0.272654 0.383698 -0.019406 -0.225515 -0.264278 0.081719 -0.082204 -0.315544 -0.029258 0.194577 -0.061208 0.031761 -0.183971 -0.187701 -0.155345 -0.160922 -0.168371 0.113818 0.094543 0.098150 0.100213 0.097685 0.093027 0.086028 0.094443 0.119052 0.095459 0.094135 0.088471 0.093841 0.098268 0.106428 0.108409 0.112784 0.161864 0.174364 0.117041 0.106883 0.138283 0.142724 0.156214 0.155956 0.156987
qa: -0.2812 -0.4697 -0.2781 0.1288 -0.0155 -0.0922 -0.2985 -0.2641 -0.2727 0.3837 -0.0194 -0.2255 -0.2643 0.0817 -0.0822 -0.3155 -0.0293 0.1946 -0.0612 0.0318 -0.1840 -0.1877 -0.1553 -0.1609 -0.1684 0.1138 0.0945 0.0982 0.1002 0.0977 0.0930 0.0860 0.0944 0.1191 0.0955 0.0941 0.0885 0.0938 0.0983 0.1064 0.1084 0.1128 0.1619 0.1744 0.1170 0.1069 0.1383 0.1427 0.1562 0.1560 0.1570
va: 2.1109 2.0189 2.2764 3.7298 3.8256 3.8473 3.8976 3.9029 3.8632 4.0855 3.7109 3.9268 3.9391 3.8522 3.7371 3.9920 3.9498 3.6367 3.8239 3.6111 3.9483 3.9368 3.8956 3.9119 3.8983 1.0049 1.0299 0.9985 1.0006 1.0151 1.0021 1.0049 1.0023 1.0011 0.9967 0.9963 1.0072 1.0057 0.9990 0.9996 0.9969 0.9989 1.0074 0.9958 1.0059 1.0089 1.0045 1.0034 0.9912 0.9918 0.9906
dispcorr: -0.022585439 hartree
energy: -1079.774489011236
dipole: 24.33864 -24.89974 -0.56110 -10.36180 9.84430 -0.51750 1.00255 -1.39948 -0.39693
magnitude: 0.86034 au
magnitude: 2.18682 debye
