program: Orca
programVersion: 5.0.2
elementType: O O O C C C C C C C C C C C C C C C C C C C C C C H H H H H H H H H H H H H H H H H H H H H H H H H H
charge: 0
multiplicity: 1
keywords: wb97x-d3
keywords: def2-TZVPP
keywords: def2/J RIJCOSX
keywords: DEFGRID2
keywords: scfconv7
keywords: smallprint printgap noloewdin
keywords: NOSOSCF
formula: C22H26O3
InChI: InChI=1/C22H26O3/c1-15(2)10-19-20(22(19,3)4)21(23)25-14-17-12-18(24-13-17)11-16-8-6-5-7-9-16/h5-10,12-13,19-20H,11,14H2,1-4H3
51 atoms
O  2.200753 1.457662 0.247713
O  2.072472 1.935677 -1.92589
O  -2.0226 2.487482 -0.412499
C  3.819304 -1.000317 -0.421905
C  2.404047 -1.443678 -0.620763
C  2.902855 -0.179459 -1.311215
C  4.297999 -0.511874 0.922705
C  4.885236 -1.764989 -1.172794
C  1.368073 -1.408793 0.44443
C  2.359702 1.165785 -1.036501
C  1.280072 -2.289112 1.444773
C  0.17564 -2.206535 2.45412
C  2.248493 -3.412279 1.6506
C  1.496311 2.665645 0.583899
C  0.030474 2.476009 0.427425
C  -0.833884 1.725659 1.289803
C  -0.753059 2.906204 -0.588557
C  -2.066406 1.763847 0.732654
C  -3.364915 1.146955 1.102311
C  -3.766494 0.040721 0.153407
C  -4.930611 0.130838 -0.600767
C  -2.967574 -1.093398 0.019703
C  -5.294082 -0.8917 -1.469498
C  -3.326988 -2.115168 -0.845069
C  -4.493971 -2.017686 -1.594185
H  2.285761 -2.265983 -1.323104
H  3.087183 -0.295737 -2.372995
H  4.77632 -1.338504 1.452554
H  5.04791 0.273704 0.810028
H  3.507748 -0.134078 1.564303
H  5.767507 -1.144497 -1.343896
H  5.202877 -2.64095 -0.602726
H  4.531696 -2.113746 -2.144074
H  0.598136 -0.647248 0.371713
H  -0.45702 -3.097891 2.425731
H  -0.461935 -1.336668 2.294393
H  0.578035 -2.144988 3.469053
H  3.019776 -3.461339 0.883435
H  1.725369 -4.372633 1.658727
H  2.744551 -3.326719 2.621108
H  1.861219 3.506541 -0.006823
H  1.756326 2.849107 1.625372
H  -0.564673 1.226148 2.207775
H  -0.556234 3.502752 -1.465669
H  -4.150046 1.907172 1.134804
H  -3.269288 0.753291 2.116678
H  -5.561031 1.007829 -0.510733
H  -2.053217 -1.178021 0.596528
H  -6.204358 -0.805135 -2.049415
H  -2.694696 -2.989653 -0.934519
H  -4.776227 -2.815375 -2.269564
elementType: O C H
totalener: -1079.74683832 hartree
nucrepener: 2202.86735602 hartree
electener: -3282.61419434 hartree
oneelecener: -5844.76631902 hartree
twoeener: 2562.15212468 hartree
cpcmener: -0.02648803 hartree
kineticenergy: 1074.86287812 hartree
xcener: -106.463239228627 hartree
chargesum: 0.0000000
charge: -0.267722 -0.474759 -0.277514 0.096657 -0.018274 -0.098790 -0.283225 -0.273794 -0.244100 0.396823 -0.026280 -0.240896 -0.265098 0.067821 -0.054294 -0.392529 -0.015367 0.236047 -0.064349 -0.002313 -0.145309 -0.125092 -0.171802 -0.197908 -0.145817 0.113008 0.091495 0.093003 0.110415 0.096395 0.098367 0.091062 0.087359 0.116273 0.103107 0.074599 0.105275 0.089854 0.106117 0.099832 0.121339 0.112931 0.171581 0.171428 0.105828 0.118781 0.138609 0.105351 0.155616 0.152900 0.157360
qa: -0.2677 -0.4748 -0.2775 0.0967 -0.0183 -0.0988 -0.2832 -0.2738 -0.2441 0.3968 -0.0263 -0.2409 -0.2651 0.0678 -0.0543 -0.3925 -0.0154 0.2360 -0.0643 -0.0023 -0.1453 -0.1251 -0.1718 -0.1979 -0.1458 0.1130 0.0915 0.0930 0.1104 0.0964 0.0984 0.0911 0.0874 0.1163 0.1031 0.0746 0.1053 0.0899 0.1061 0.0998 0.1213 0.1129 0.1716 0.1714 0.1058 0.1188 0.1386 0.1054 0.1556 0.1529 0.1574
va: 2.1084 2.0303 2.2810 3.6824 3.8029 3.8626 3.8777 3.9094 3.8425 4.1632 3.6455 3.9282 3.9378 3.8396 3.6184 3.9715 3.9771 3.5803 3.8052 3.6511 3.9023 3.8705 3.9132 3.9427 3.8802 1.0054 1.0273 0.9988 1.0031 1.0108 1.0014 1.0035 1.0056 0.9836 0.9971 1.0002 0.9972 1.0067 0.9999 0.9965 1.0093 0.9969 0.9998 1.0027 1.0108 1.0039 1.0032 1.0085 0.9917 0.9934 0.9899
dispcorr: -0.027529485 hartree
energy: -1079.774367803970
dipole: 14.98457 -14.79221 0.19236 -19.47611 18.46653 -1.00958 9.86189 -8.31713 1.54476
magnitude: 1.85541 au
magnitude: 4.71607 debye
