program: Orca
programVersion: 5.0.2
elementType: O O O C C C C C C C C C C C C C C C C C C C C C C H H H H H H H H H H H H H H H H H H H H H H H H H H
charge: 0
multiplicity: 1
keywords: wb97x-d3
keywords: def2-TZVPP
keywords: def2/J RIJCOSX
keywords: DEFGRID2
keywords: scfconv7
keywords: smallprint printgap noloewdin
keywords: NOSOSCF
formula: C22H26O3
InChI: InChI=1/C22H26O3/c1-15(2)10-19-20(22(19,3)4)21(23)25-14-17-12-18(24-13-17)11-16-8-6-5-7-9-16/h5-10,12-13,19-20H,11,14H2,1-4H3
51 atoms
O  2.380597 2.30899 -0.273225
O  1.3213 0.93979 -1.684276
O  -1.461259 2.685458 1.439642
C  2.191009 -0.840564 0.896504
C  2.805249 -1.409062 -0.350519
C  2.904145 0.072074 -0.091308
C  0.687635 -0.786872 1.020283
C  2.897832 -1.0772 2.207577
C  2.005871 -2.026162 -1.444332
C  2.119376 1.107688 -0.79434
C  1.515884 -3.267895 -1.391236
C  0.772303 -3.865882 -2.546581
C  1.66379 -4.168561 -0.203145
C  1.489232 3.38915 -0.599742
C  0.133758 3.133407 -0.035965
C  -1.043612 2.715797 -0.732397
C  -0.188828 3.100396 1.27951
C  -1.977689 2.450463 0.209523
C  -3.322612 1.821974 0.138675
C  -3.200576 0.324292 0.308454
C  -3.382654 -0.27535 1.550019
C  -2.831141 -0.471829 -0.773606
C  -3.206492 -1.644907 1.706406
C  -2.651381 -1.83834 -0.620319
C  -2.83965 -2.43036 0.622668
H  3.7557 -1.909245 -0.1767
H  3.870213 0.431207 0.247713
H  0.322473 -1.707698 1.479758
H  0.375881 0.040916 1.661669
H  0.177029 -0.679519 0.065726
H  2.580564 -2.023455 2.652106
H  3.981184 -1.115573 2.084785
H  2.67347 -0.28545 2.925752
H  1.852076 -1.452199 -2.350248
H  0.65097 -3.16162 -3.369718
H  -0.221445 -4.206891 -2.243581
H  1.293332 -4.74679 -2.932556
H  2.233173 -3.722383 0.610645
H  2.160342 -5.101468 -0.484663
H  0.683926 -4.45149 0.191516
H  1.449637 3.55044 -1.677892
H  1.954313 4.263545 -0.147629
H  -1.163292 2.605937 -1.798653
H  0.367337 3.333158 2.175007
H  -3.764827 2.05601 -0.830912
H  -3.98258 2.240525 0.901988
H  -3.668468 0.330095 2.402387
H  -2.677084 -0.016563 -1.745402
H  -3.357322 -2.097701 2.678357
H  -2.36233 -2.44154 -1.472037
H  -2.702519 -3.497288 0.744355
elementType: O C H
totalener: -1079.74534031 hartree
nucrepener: 2267.88928245 hartree
electener: -3347.63462276 hartree
oneelecener: -5975.92051254 hartree
twoeener: 2628.28588978 hartree
cpcmener: -0.02581283 hartree
kineticenergy: 1074.85963686 hartree
xcener: -106.461720407621 hartree
chargesum: 0.0000000
charge: -0.282579 -0.450373 -0.270423 0.139949 -0.032373 -0.068655 -0.306433 -0.273315 -0.250715 0.350670 -0.037025 -0.238754 -0.255745 0.076584 -0.025057 -0.324580 -0.073722 0.198634 -0.052853 0.068461 -0.206198 -0.206643 -0.127121 -0.147573 -0.197141 0.114785 0.099197 0.108266 0.110032 0.067762 0.092222 0.088576 0.097560 0.114416 0.091877 0.087279 0.101220 0.087986 0.105249 0.095729 0.117729 0.121399 0.154342 0.170850 0.113575 0.107466 0.138379 0.138743 0.155335 0.159246 0.153759
qa: -0.2826 -0.4504 -0.2704 0.1399 -0.0324 -0.0687 -0.3064 -0.2733 -0.2507 0.3507 -0.0370 -0.2388 -0.2557 0.0766 -0.0251 -0.3246 -0.0737 0.1986 -0.0529 0.0685 -0.2062 -0.2066 -0.1271 -0.1476 -0.1971 0.1148 0.0992 0.1083 0.1100 0.0678 0.0922 0.0886 0.0976 0.1144 0.0919 0.0873 0.1012 0.0880 0.1052 0.0957 0.1177 0.1214 0.1543 0.1708 0.1136 0.1075 0.1384 0.1387 0.1553 0.1592 0.1538
va: 2.1128 2.0373 2.2595 3.7094 3.8188 3.8428 3.9213 3.8967 3.8151 4.2039 3.7114 3.9289 3.9356 3.8565 3.5758 3.9896 3.9366 3.6298 3.8269 3.5625 3.9526 3.9083 3.8634 3.8401 3.8834 1.0037 1.0277 0.9980 1.0028 1.0004 1.0022 1.0052 1.0024 1.0293 1.0061 0.9965 0.9967 1.0082 1.0011 0.9990 1.0030 0.9954 1.0149 0.9970 1.0090 1.0146 1.0067 1.0060 0.9903 0.9875 0.9936
dispcorr: -0.029927148 hartree
energy: -1079.775267454049
dipole: 6.05345 -5.80574 0.24771 -22.14074 22.05710 -0.08363 1.65923 -0.86307 0.79615
magnitude: 0.83798 au
magnitude: 2.12998 debye
