program: Orca
programVersion: 5.0.2
elementType: O O O C C C C C C C C C C C C C C C C C C C C C C H H H H H H H H H H H H H H H H H H H H H H H H H H
charge: 0
multiplicity: 1
keywords: wb97x-d3
keywords: def2-TZVPP
keywords: def2/J RIJCOSX
keywords: DEFGRID2
keywords: scfconv7
keywords: smallprint printgap noloewdin
keywords: NOSOSCF
formula: C22H26O3
InChI: InChI=1/C22H26O3/c1-15(2)10-19-20(22(19,3)4)21(23)25-14-17-12-18(24-13-17)11-16-8-6-5-7-9-16/h5-10,12-13,19-20H,11,14H2,1-4H3
51 atoms
O  1.642424 0.991034 -1.568908
O  2.776101 1.599704 0.256905
O  -1.365459 1.413197 1.565895
C  4.660786 -0.79318 -0.288016
C  3.45501 -1.412472 0.328337
C  3.303695 -0.45331 -0.865213
C  5.485222 0.219454 0.468418
C  5.505566 -1.684248 -1.170098
C  2.961412 -1.055397 1.67875
C  2.591662 0.815915 -0.643984
C  1.698594 -1.247613 2.069682
C  1.244436 -0.919326 3.456926
C  0.655727 -1.78994 1.131701
C  0.720657 2.075616 -1.371804
C  -0.311548 1.713856 -0.361909
C  -1.517205 0.974658 -0.596096
C  -0.277268 1.944909 0.971914
C  -2.117764 0.821605 0.607944
C  -3.369175 0.147599 1.051451
C  -4.234975 -0.22031 -0.121935
C  -4.165899 -1.488082 -0.689872
C  -5.096363 0.720319 -0.68134
C  -4.94389 -1.812855 -1.794219
C  -5.874925 0.399567 -1.783808
C  -5.79974 -0.869183 -2.344459
H  3.259899 -2.442488 0.038527
H  3.062034 -0.933167 -1.806686
H  4.912609 0.843107 1.148258
H  6.244543 -0.299236 1.057933
H  6.00767 0.881395 -0.225212
H  6.036705 -1.101135 -1.925076
H  6.251974 -2.214823 -0.575065
H  4.905653 -2.433167 -1.689237
H  3.674848 -0.644347 2.386367
H  0.842792 -1.803868 3.959141
H  0.435733 -0.183069 3.437436
H  2.050337 -0.519672 4.072722
H  0.548002 -1.167584 0.240803
H  -0.323145 -1.852084 1.607637
H  0.908045 -2.79398 0.780754
H  0.264423 2.231337 -2.348315
H  1.250068 2.989483 -1.100664
H  -1.879797 0.614813 -1.546412
H  0.420555 2.461058 1.612038
H  -3.917464 0.808149 1.729483
H  -3.122145 -0.748241 1.63014
H  -3.49918 -2.229344 -0.264357
H  -5.158842 1.712365 -0.248838
H  -4.881724 -2.804719 -2.223752
H  -6.542448 1.140684 -2.205075
H  -6.40712 -1.120682 -3.204526
elementType: O C H
totalener: -1079.74932310 hartree
nucrepener: 2178.32289158 hartree
electener: -3258.07221468 hartree
oneelecener: -5796.06778974 hartree
twoeener: 2537.99557506 hartree
cpcmener: -0.02375630 hartree
kineticenergy: 1074.85372639 hartree
xcener: -106.461523199770 hartree
chargesum: 0.0000000
charge: -0.290614 -0.464229 -0.281106 0.137447 -0.023885 -0.100081 -0.297879 -0.266055 -0.256210 0.378128 -0.010364 -0.218277 -0.293225 0.080487 -0.077793 -0.303269 -0.020929 0.165626 0.000391 0.004946 -0.182767 -0.193541 -0.160637 -0.153861 -0.162876 0.110276 0.090573 0.094224 0.097478 0.099062 0.095747 0.093793 0.085434 0.121052 0.101545 0.088229 0.087199 0.088441 0.098113 0.115480 0.117856 0.118530 0.155675 0.168383 0.108829 0.103351 0.141167 0.139313 0.156285 0.156698 0.157838
qa: -0.2906 -0.4642 -0.2811 0.1374 -0.0239 -0.1001 -0.2979 -0.2661 -0.2562 0.3781 -0.0104 -0.2183 -0.2932 0.0805 -0.0778 -0.3033 -0.0209 0.1656 0.0004 0.0049 -0.1828 -0.1935 -0.1606 -0.1539 -0.1629 0.1103 0.0906 0.0942 0.0975 0.0991 0.0957 0.0938 0.0854 0.1211 0.1015 0.0882 0.0872 0.0884 0.0981 0.1155 0.1179 0.1185 0.1557 0.1684 0.1088 0.1034 0.1412 0.1393 0.1563 0.1567 0.1578
va: 2.1013 2.0210 2.2552 3.7612 3.8040 3.8342 3.8886 3.8964 3.8081 4.1338 3.6695 3.9106 3.9614 3.8373 3.6239 3.9467 3.9126 3.6371 3.8088 3.6264 3.9216 3.9367 3.9072 3.8956 3.8912 1.0051 1.0328 1.0190 0.9985 1.0008 1.0027 1.0026 1.0047 1.0022 0.9941 1.0011 1.0089 1.0023 1.0058 1.0016 0.9932 1.0115 1.0052 1.0079 1.0090 1.0047 1.0038 1.0037 0.9914 0.9908 0.9901
dispcorr: -0.027142203 hartree
energy: -1079.776465303021
dipole: 14.50256 -15.07424 -0.57168 -11.21963 10.38249 -0.83714 4.28639 -4.92785 -0.64146
magnitude: 1.19962 au
magnitude: 3.04920 debye
