program: Orca
programVersion: 5.0.2
elementType: O O O C C C C C C C C C C C C C C C C C C C C C C H H H H H H H H H H H H H H H H H H H H H H H H H H
charge: 0
multiplicity: 1
keywords: wb97x-d3
keywords: def2-TZVPP
keywords: def2/J RIJCOSX
keywords: DEFGRID2
keywords: scfconv7
keywords: smallprint printgap noloewdin
keywords: NOSOSCF
formula: C22H26O3
InChI: InChI=1/C22H26O3/c1-15(2)10-19-20(22(19,3)4)21(23)25-14-17-12-18(24-13-17)11-16-8-6-5-7-9-16/h5-10,12-13,19-20H,11,14H2,1-4H3
51 atoms
O  2.399086 2.165786 -0.228096
O  1.685389 0.690045 1.2854
O  -1.687038 1.777043 -1.325572
C  4.090862 -1.070213 0.465084
C  3.058593 -1.347953 -0.572299
C  3.441276 0.102916 -0.239539
C  3.833382 -1.36316 1.922943
C  5.530289 -1.312169 0.072103
C  1.713789 -1.884327 -0.252952
C  2.428063 0.973322 0.376585
C  0.667831 -1.836643 -1.082478
C  -0.65645 -2.424397 -0.705364
C  0.718147 -1.196379 -2.436513
C  1.384807 3.083716 0.190894
C  0.017936 2.615339 -0.179412
C  -1.126344 2.533035 0.674301
C  -0.388523 2.146612 -1.382429
C  -2.133564 2.022273 -0.072567
C  -3.536436 1.652641 0.24679
C  -3.713254 0.162792 0.428182
C  -3.237095 -0.462387 1.578917
C  -4.3361 -0.610215 -0.54532
C  -3.393203 -1.828321 1.758367
C  -4.49043 -1.980564 -0.370334
C  -4.022075 -2.592909 0.782828
H  3.448999 -1.652382 -1.539366
H  4.052947 0.597795 -0.985068
H  4.427054 -0.700346 2.555533
H  2.795559 -1.259661 2.224536
H  4.140844 -2.387032 2.146253
H  6.207812 -0.695288 0.666126
H  5.802649 -2.356901 0.236444
H  5.71088 -1.085617 -0.979689
H  1.584353 -2.369067 0.709711
H  -1.423604 -1.64599 -0.670505
H  -0.628052 -2.916618 0.266494
H  -0.992859 -3.155201 -1.446174
H  1.58071 -0.545638 -2.574075
H  -0.182164 -0.605377 -2.618365
H  0.747857 -1.95615 -3.223591
H  1.639062 4.015621 -0.313569
H  1.44753 3.266065 1.265612
H  -1.181534 2.813392 1.714884
H  0.112104 2.021112 -2.32986
H  -4.207667 2.013747 -0.536684
H  -3.817206 2.172655 1.164483
H  -2.74254 0.126842 2.343183
H  -4.71093 -0.138241 -1.446149
H  -3.022861 -2.298089 2.660912
H  -4.980501 -2.568402 -1.136346
H  -4.144828 -3.659423 0.922612
elementType: O C H
totalener: -1079.74908568 hartree
nucrepener: 2236.77568202 hartree
electener: -3316.52476770 hartree
oneelecener: -5913.86557903 hartree
twoeener: 2597.34081133 hartree
cpcmener: -0.02725382 hartree
kineticenergy: 1074.87195639 hartree
xcener: -106.466306743860 hartree
chargesum: -0.0000000
charge: -0.290350 -0.460791 -0.276850 0.143541 -0.036976 -0.093885 -0.299902 -0.263466 -0.241663 0.368471 -0.016639 -0.198791 -0.298341 0.101981 -0.031951 -0.326999 -0.075877 0.201995 -0.067044 0.029378 -0.163114 -0.168864 -0.190702 -0.166903 -0.152138 0.111309 0.091748 0.099674 0.093904 0.097823 0.094554 0.094396 0.086047 0.120666 0.054479 0.092806 0.099739 0.096307 0.089952 0.119232 0.117150 0.115589 0.158893 0.172579 0.108946 0.117200 0.140308 0.138055 0.154731 0.154384 0.155407
qa: -0.2904 -0.4608 -0.2768 0.1435 -0.0370 -0.0939 -0.2999 -0.2635 -0.2417 0.3685 -0.0166 -0.1988 -0.2983 0.1020 -0.0320 -0.3270 -0.0759 0.2020 -0.0670 0.0294 -0.1631 -0.1689 -0.1907 -0.1669 -0.1521 0.1113 0.0917 0.0997 0.0939 0.0978 0.0946 0.0944 0.0860 0.1207 0.0545 0.0928 0.0997 0.0963 0.0900 0.1192 0.1172 0.1156 0.1589 0.1726 0.1089 0.1172 0.1403 0.1381 0.1547 0.1544 0.1554
va: 2.1167 2.0262 2.2581 3.7541 3.8135 3.8275 3.8932 3.8958 3.8386 4.1452 3.7038 3.9278 3.9521 3.8297 3.6090 4.0128 3.9300 3.6253 3.8171 3.6051 3.8866 3.9100 3.8986 3.8861 3.8436 1.0031 1.0305 1.0003 1.0198 0.9988 1.0029 1.0022 1.0043 1.0030 1.0028 1.0057 0.9980 1.0023 0.9982 0.9981 0.9934 1.0063 1.0062 0.9953 1.0111 1.0066 1.0042 1.0042 0.9937 0.9925 0.9916
dispcorr: -0.028287544 hartree
energy: -1079.777373227109
dipole: 10.95734 -10.63088 0.32646 -14.23269 14.53297 0.30029 -1.06299 0.47622 -0.58677
magnitude: 0.73556 au
magnitude: 1.86964 debye
