program: Orca
programVersion: 5.0.2
elementType: O O O C C C C C C C C C C C C C C C C C C C C C C H H H H H H H H H H H H H H H H H H H H H H H H H H
charge: 0
multiplicity: 1
keywords: wb97x-d3
keywords: def2-TZVPP
keywords: def2/J RIJCOSX
keywords: DEFGRID2
keywords: scfconv7
keywords: smallprint printgap noloewdin
keywords: NOSOSCF
formula: C22H26O3
InChI: InChI=1/C22H26O3/c1-15(2)10-19-20(22(19,3)4)21(23)25-14-17-12-18(24-13-17)11-16-8-6-5-7-9-16/h5-10,12-13,19-20H,11,14H2,1-4H3
51 atoms
O  2.313531 1.439659 0.347061
O  2.318077 1.641419 -1.873222
O  -1.905307 2.343777 -0.664286
C  4.281491 -0.868652 0.022919
C  2.919725 -1.478169 -0.013442
C  3.258645 -0.302965 -0.943471
C  4.765718 -0.094785 1.224297
C  5.394027 -1.647854 -0.641324
C  1.952963 -1.388465 1.101293
C  2.594111 1.010503 -0.876715
C  0.748663 -1.968151 1.081445
C  -0.162417 -1.917868 2.268423
C  0.233897 -2.716459 -0.118228
C  1.559718 2.656076 0.477612
C  0.109653 2.412588 0.260885
C  -0.793099 1.745593 1.151392
C  -0.628017 2.742984 -0.824469
C  -2.001574 1.734453 0.542727
C  -3.322123 1.18588 0.932527
C  -3.797958 0.017492 0.096998
C  -2.913858 -0.809629 -0.588881
C  -5.159167 -0.276108 0.045631
C  -3.377968 -1.908448 -1.300873
C  -5.624937 -1.375426 -0.660461
C  -4.734068 -2.198047 -1.337362
H  2.854346 -2.40689 -0.573066
H  3.41787 -0.589319 -1.976632
H  5.512944 0.642743 0.924653
H  3.987994 0.430536 1.770322
H  5.248287 -0.779945 1.924741
H  5.038039 -2.213177 -1.503763
H  6.188436 -0.982303 -0.985449
H  5.836703 -2.358645 0.059833
H  2.259266 -0.868071 2.002205
H  -0.406433 -2.925605 2.617001
H  -1.115398 -1.444595 2.014864
H  0.275777 -1.371807 3.104295
H  0.319769 -2.132752 -1.036459
H  -0.814104 -2.989164 0.003349
H  0.785582 -3.646524 -0.281591
H  1.942215 3.423766 -0.195636
H  1.747928 2.983048 1.499334
H  -0.564805 1.333562 2.122367
H  -0.389687 3.254181 -1.744386
H  -4.078917 1.975632 0.906508
H  -3.252207 0.87562 1.978541
H  -1.849817 -0.605684 -0.571034
H  -5.863797 0.36189 0.566976
H  -2.673651 -2.539285 -1.828665
H  -6.686403 -1.587372 -0.685424
H  -5.09496 -3.055062 -1.891535
elementType: O C H
totalener: -1079.74758395 hartree
nucrepener: 2209.64688769 hartree
electener: -3289.39447164 hartree
oneelecener: -5858.41413562 hartree
twoeener: 2569.01966398 hartree
cpcmener: -0.02653001 hartree
kineticenergy: 1074.85892668 hartree
xcener: -106.463661172282 hartree
chargesum: 0.0000000
charge: -0.269002 -0.477490 -0.281383 0.127367 -0.018879 -0.105225 -0.286067 -0.265109 -0.271202 0.402479 -0.009603 -0.225295 -0.327027 0.068088 -0.045980 -0.382246 -0.017868 0.252280 -0.071731 0.065687 -0.221017 -0.193905 -0.166415 -0.152655 -0.173741 0.110744 0.091014 0.101164 0.092292 0.098116 0.086901 0.095397 0.093594 0.117606 0.112382 0.080852 0.091348 0.110418 0.093671 0.117314 0.120569 0.113377 0.164699 0.171346 0.111417 0.109448 0.155263 0.136820 0.157045 0.156262 0.156880
qa: -0.2690 -0.4775 -0.2814 0.1274 -0.0189 -0.1052 -0.2861 -0.2651 -0.2712 0.4025 -0.0096 -0.2253 -0.3270 0.0681 -0.0460 -0.3822 -0.0179 0.2523 -0.0717 0.0657 -0.2210 -0.1939 -0.1664 -0.1527 -0.1737 0.1107 0.0910 0.1012 0.0923 0.0981 0.0869 0.0954 0.0936 0.1176 0.1124 0.0809 0.0913 0.1104 0.0937 0.1173 0.1206 0.1134 0.1647 0.1713 0.1114 0.1094 0.1553 0.1368 0.1570 0.1563 0.1569
va: 2.1109 2.0293 2.2800 3.7769 3.7470 3.8598 3.8944 3.8981 3.8229 4.1567 3.6592 3.9079 3.9602 3.8353 3.6182 3.9754 3.9687 3.5443 3.8604 3.6389 3.8993 3.9568 3.9142 3.8930 3.9208 1.0023 1.0297 1.0001 1.0147 0.9994 1.0055 1.0022 1.0023 1.0088 0.9969 0.9906 1.0079 0.9886 1.0029 1.0014 1.0099 0.9964 1.0037 1.0025 1.0060 0.9995 0.9845 1.0030 0.9918 0.9904 0.9906
dispcorr: -0.027805297 hartree
energy: -1079.775389245010
dipole: 11.88958 -11.85302 0.03656 -16.36195 15.65885 -0.70310 7.96414 -6.50181 1.46233
magnitude: 1.62299 au
magnitude: 4.12531 debye
