program: Orca
programVersion: 5.0.2
elementType: O O O C C C C C C C C C C C C C C C C C C C C C C H H H H H H H H H H H H H H H H H H H H H H H H H H
charge: 0
multiplicity: 1
keywords: wb97x-d3
keywords: def2-TZVPP
keywords: def2/J RIJCOSX
keywords: DEFGRID2
keywords: scfconv7
keywords: smallprint printgap noloewdin
keywords: NOSOSCF
formula: C22H26O3
InChI: InChI=1/C22H26O3/c1-15(2)10-19-20(22(19,3)4)21(23)25-14-17-12-18(24-13-17)11-16-8-6-5-7-9-16/h5-10,12-13,19-20H,11,14H2,1-4H3
51 atoms
O  1.604604 1.42219 -1.404228
O  2.780023 1.479798 0.494918
O  -1.347749 1.611282 1.804296
C  4.338143 -0.965952 -0.594631
C  3.099341 -1.534053 0.005234
C  3.002612 -0.375978 -1.004254
C  5.325986 -0.189435 0.241866
C  5.01008 -1.782439 -1.674811
C  2.726627 -1.350012 1.427411
C  2.491747 0.922265 -0.538104
C  1.470761 -1.428266 1.875685
C  1.134056 -1.216818 3.318594
C  0.310479 -1.672866 0.953547
C  0.832946 2.557952 -0.979509
C  -0.244657 2.129819 -0.047741
C  -1.477982 1.489305 -0.399752
C  -0.224484 2.166706 1.304894
C  -2.107884 1.196598 0.762486
C  -3.406414 0.5489 1.094099
C  -3.996822 -0.157875 -0.095684
C  -5.055673 0.397824 -0.804746
C  -3.476904 -1.380875 -0.515788
C  -5.592203 -0.256446 -1.907411
C  -4.008667 -2.035853 -1.616021
C  -5.070572 -1.474955 -2.315644
H  2.760117 -2.469804 -0.433922
H  2.653834 -0.659557 -1.990486
H  4.882341 0.353083 1.071672
H  6.066374 -0.877086 0.657953
H  5.864421 0.532872 -0.375109
H  4.288965 -2.338578 -2.275841
H  5.582657 -1.143502 -2.350091
H  5.701051 -2.505507 -1.236143
H  3.522766 -1.145697 2.136626
H  0.438526 -0.379488 3.43098
H  2.015756 -1.004698 3.923732
H  0.632801 -2.091306 3.742571
H  -0.598548 -1.909822 1.507498
H  0.496644 -2.495892 0.260702
H  0.097347 -0.791546 0.342473
H  0.414707 2.966483 -1.898229
H  1.472396 3.321135 -0.534796
H  -1.836622 1.278603 -1.395321
H  0.488782 2.541327 2.022199
H  -4.110693 1.298625 1.468838
H  -3.254336 -0.161854 1.912369
H  -5.470425 1.348606 -0.490901
H  -2.650935 -1.827208 0.026944
H  -6.419805 0.187808 -2.445868
H  -3.595937 -2.987527 -1.926202
H  -5.488072 -1.987004 -3.173227
elementType: O C H
totalener: -1079.74934356 hartree
nucrepener: 2201.89473608 hartree
electener: -3281.64407964 hartree
oneelecener: -5843.17215345 hartree
twoeener: 2561.52807381 hartree
cpcmener: -0.02417659 hartree
kineticenergy: 1074.84973050 hartree
xcener: -106.461466365392 hartree
chargesum: 0.0000000
charge: -0.291619 -0.464830 -0.280062 0.129181 -0.024414 -0.082560 -0.295667 -0.264990 -0.254432 0.365511 -0.006697 -0.220017 -0.290316 0.084218 -0.075818 -0.293692 -0.023257 0.164012 -0.020210 -0.000493 -0.167768 -0.194466 -0.159979 -0.168063 -0.161654 0.111308 0.089118 0.093402 0.097298 0.099739 0.085677 0.095314 0.094046 0.120459 0.090184 0.087346 0.097984 0.106090 0.113646 0.077476 0.118420 0.116833 0.154856 0.168564 0.103161 0.114090 0.137984 0.156219 0.156204 0.155328 0.157336
qa: -0.2916 -0.4648 -0.2801 0.1292 -0.0244 -0.0826 -0.2957 -0.2650 -0.2544 0.3655 -0.0067 -0.2200 -0.2903 0.0842 -0.0758 -0.2937 -0.0233 0.1640 -0.0202 -0.0005 -0.1678 -0.1945 -0.1600 -0.1681 -0.1617 0.1113 0.0891 0.0934 0.0973 0.0997 0.0857 0.0953 0.0940 0.1205 0.0902 0.0873 0.0980 0.1061 0.1136 0.0775 0.1184 0.1168 0.1549 0.1686 0.1032 0.1141 0.1380 0.1562 0.1562 0.1553 0.1573
va: 2.1033 2.0200 2.2537 3.7659 3.8126 3.8288 3.8896 3.8980 3.8179 4.1399 3.6903 3.9150 3.9640 3.8411 3.6314 3.9336 3.9142 3.6256 3.8008 3.6228 3.9280 3.9124 3.9010 3.9313 3.8930 1.0063 1.0324 1.0190 0.9985 1.0005 1.0047 1.0026 1.0024 1.0000 1.0001 1.0088 0.9960 1.0014 1.0020 0.9979 0.9927 1.0116 1.0061 1.0057 1.0080 1.0050 1.0045 0.9933 0.9911 0.9929 0.9904
dispcorr: -0.027833002 hartree
energy: -1079.777176561734
dipole: 12.87894 -13.55289 -0.67395 -12.52500 11.94364 -0.58137 2.00125 -2.76164 -0.76039
magnitude: 1.17064 au
magnitude: 2.97553 debye
