program: Orca
programVersion: 5.0.2
elementType: O O O C C C C C C C C C C C C C C C C C C C C C C H H H H H H H H H H H H H H H H H H H H H H H H H H
charge: 0
multiplicity: 1
keywords: wb97x-d3
keywords: def2-TZVPP
keywords: def2/J RIJCOSX
keywords: DEFGRID2
keywords: scfconv7
keywords: smallprint printgap noloewdin
keywords: NOSOSCF
formula: C22H26O3
InChI: InChI=1/C22H26O3/c1-15(2)10-19-20(22(19,3)4)21(23)25-14-17-12-18(24-13-17)11-16-8-6-5-7-9-16/h5-10,12-13,19-20H,11,14H2,1-4H3
51 atoms
O  2.034987 1.748451 -1.048155
O  2.569775 1.309004 1.073987
O  -1.651403 0.233217 0.840501
C  5.037367 -0.200465 0.002953
C  3.9140 -1.151072 -0.233392
C  3.806755 0.303341 -0.717874
C  5.390641 0.257514 1.396596
C  6.254804 -0.354804 -0.880079
C  3.043384 -1.669171 0.85131
C  2.776739 1.15899 -0.106599
C  1.814957 -2.153961 0.649916
C  0.989771 -2.705511 1.771138
C  1.170367 -2.195483 -0.702408
C  0.863762 2.459652 -0.617522
C  -0.240943 1.518749 -0.289424
C  -1.063749 0.796641 -1.215097
C  -0.645731 1.125374 0.940697
C  -1.900512 0.032684 -0.475514
C  -2.997026 -0.907597 -0.824807
C  -4.352481 -0.352087 -0.457736
C  -4.89473 -0.569204 0.805959
C  -5.062596 0.426977 -1.367044
C  -6.121283 -0.01861 1.153677
C  -6.290273 0.975606 -1.023596
C  -6.82246 0.756844 0.240406
H  4.059859 -1.839536 -1.061546
H  3.910333 0.435511 -1.78882
H  6.132766 -0.421729 1.8218
H  5.838244 1.252942 1.37071
H  4.548929 0.294323 2.081235
H  6.802561 0.586515 -0.95997
H  6.936881 -1.101582 -0.468189
H  5.990349 -0.670944 -1.890212
H  3.44567 -1.67415 1.859792
H  0.072636 -2.123694 1.897858
H  1.525245 -2.704246 2.720426
H  0.675515 -3.731835 1.561884
H  1.292981 -3.180946 -1.160664
H  1.581001 -1.461801 -1.39458
H  0.096236 -2.020695 -0.629714
H  0.598001 3.089792 -1.465103
H  1.093555 3.11376 0.224428
H  -1.031025 0.847558 -2.292434
H  -0.327567 1.388082 1.937514
H  -2.837633 -1.867875 -0.326029
H  -2.945973 -1.096814 -1.897796
H  -4.357858 -1.177823 1.52432
H  -4.651171 0.60498 -2.354157
H  -6.530511 -0.197296 2.140119
H  -6.831618 1.575447 -1.744306
H  -7.77954 1.185195 0.510075
elementType: O C H
totalener: -1079.75017387 hartree
nucrepener: 2162.74716988 hartree
electener: -3242.49734375 hartree
oneelecener: -5765.13065381 hartree
twoeener: 2522.63331006 hartree
cpcmener: -0.02566122 hartree
kineticenergy: 1074.87250544 hartree
xcener: -106.464092278734 hartree
chargesum: -0.0000000
charge: -0.288609 -0.463120 -0.281090 0.140585 -0.030297 -0.091806 -0.297248 -0.264495 -0.268170 0.368956 -0.003218 -0.217891 -0.294292 0.086556 -0.038755 -0.357808 -0.028569 0.202513 -0.054818 0.075083 -0.206537 -0.203443 -0.157792 -0.155069 -0.171051 0.112675 0.092521 0.096490 0.099857 0.093379 0.094802 0.094514 0.085185 0.120845 0.085064 0.088932 0.099515 0.121691 0.096895 0.086959 0.119183 0.115815 0.152838 0.166248 0.115669 0.110606 0.140327 0.140296 0.156322 0.155967 0.157792
qa: -0.2886 -0.4631 -0.2811 0.1406 -0.0303 -0.0918 -0.2972 -0.2645 -0.2682 0.3690 -0.0032 -0.2179 -0.2943 0.0866 -0.0388 -0.3578 -0.0286 0.2025 -0.0548 0.0751 -0.2065 -0.2034 -0.1578 -0.1551 -0.1711 0.1127 0.0925 0.0965 0.0999 0.0934 0.0948 0.0945 0.0852 0.1208 0.0851 0.0889 0.0995 0.1217 0.0969 0.0870 0.1192 0.1158 0.1528 0.1662 0.1157 0.1106 0.1403 0.1403 0.1563 0.1560 0.1578
va: 2.1059 2.0244 2.2572 3.7548 3.8074 3.8233 3.8897 3.8981 3.8437 4.1539 3.6712 3.9207 3.9510 3.8437 3.5526 3.9968 3.9337 3.5686 3.8009 3.5562 3.9641 3.9479 3.9029 3.8990 3.9014 1.0034 1.0309 0.9988 1.0003 1.0187 1.0026 1.0023 1.0043 1.0033 1.0032 1.0088 0.9950 0.9987 1.0047 0.9996 0.9915 1.0117 1.0125 1.0047 1.0045 1.0093 1.0083 1.0047 0.9913 0.9913 0.9904
dispcorr: -0.026582032 hartree
energy: -1079.776755900578
dipole: 16.23186 -16.33321 -0.10136 -11.04450 10.63683 -0.40767 0.15212 -1.37569 -1.22357
magnitude: 1.29367 au
magnitude: 3.28825 debye
