program: Orca
programVersion: 5.0.2
elementType: O O O C C C C C C C C C C C C C C C C C C C C C C H H H H H H H H H H H H H H H H H H H H H H H H H H
charge: 0
multiplicity: 1
keywords: wb97x-d3
keywords: def2-TZVPP
keywords: def2/J RIJCOSX
keywords: DEFGRID2
keywords: scfconv7
keywords: smallprint printgap noloewdin
keywords: NOSOSCF
formula: C22H26O3
InChI: InChI=1/C22H26O3/c1-15(2)10-19-20(22(19,3)4)21(23)25-14-17-12-18(24-13-17)11-16-8-6-5-7-9-16/h5-10,12-13,19-20H,11,14H2,1-4H3
51 atoms
O  2.298234 1.567925 0.207367
O  2.101378 2.05089 -1.962268
O  -1.822016 1.918494 1.435282
C  3.489435 -1.100079 -0.435662
C  2.069649 -1.317532 -0.860459
C  2.840194 -0.104671 -1.374242
C  3.833168 -0.780551 0.998996
C  4.530024 -1.978808 -1.0932
C  0.900655 -1.173225 0.048199
C  2.383287 1.269454 -1.081023
C  0.55738 -2.060883 0.984974
C  -0.667597 -1.871899 1.825812
C  1.345998 -3.298887 1.279444
C  1.624661 2.77999 0.594736
C  0.158785 2.539277 0.65079
C  -0.774513 2.468193 -0.435596
C  -0.542151 2.193442 1.755821
C  -1.95634 2.079219 0.096988
C  -3.260582 1.703774 -0.505679
C  -3.440498 0.202484 -0.494002
C  -4.331004 -0.408211 0.381546
C  -2.671409 -0.597674 -1.336721
C  -4.457421 -1.792139 0.411583
C  -2.793811 -1.978511 -1.308426
C  -3.688555 -2.580848 -0.431697
H  1.939466 -2.075087 -1.630386
H  3.151499 -0.184345 -2.409754
H  3.014054 -0.348352 1.565618
H  4.12654 -1.702066 1.506518
H  4.68404 -0.098968 1.05682
H  4.278851 -2.206646 -2.130234
H  5.511274 -1.499378 -1.087309
H  4.622997 -2.927203 -0.559283
H  0.24757 -0.318741 -0.103951
H  -1.211686 -0.962022 1.5705
H  -0.404831 -1.818347 2.886378
H  -1.35295 -2.717271 1.72174
H  2.212636 -3.420219 0.631541
H  0.71945 -4.188259 1.16772
H  1.696745 -3.301227 2.315011
H  1.887184 3.599997 -0.073509
H  2.015091 3.012616 1.584116
H  -0.586519 2.669081 -1.478145
H  -0.270142 2.107241 2.796723
H  -3.280506 2.078732 -1.530433
H  -4.085203 2.185477 0.025539
H  -4.933774 0.201048 1.044914
H  -1.967258 -0.135822 -2.019785
H  -5.156378 -2.253091 1.098121
H  -2.18918 -2.585926 -1.970096
H  -3.784294 -3.65893 -0.407652
elementType: O C H
totalener: -1079.74649447 hartree
nucrepener: 2272.19551168 hartree
electener: -3351.94200615 hartree
oneelecener: -5983.74260397 hartree
twoeener: 2631.80059781 hartree
cpcmener: -0.02513610 hartree
kineticenergy: 1074.86114515 hartree
xcener: -106.464028917208 hartree
chargesum: -0.0000000
charge: -0.260417 -0.474759 -0.272400 0.107916 -0.015836 -0.112726 -0.282292 -0.273804 -0.230212 0.396049 -0.007388 -0.257396 -0.267944 0.049472 -0.065651 -0.294362 -0.045545 0.189603 -0.044388 0.044518 -0.172289 -0.213527 -0.147523 -0.154192 -0.177540 0.107083 0.093723 0.094276 0.092574 0.108930 0.087013 0.098111 0.090710 0.096649 0.065542 0.112820 0.101896 0.090535 0.107462 0.100279 0.122869 0.112353 0.156929 0.173153 0.115633 0.106974 0.137228 0.144663 0.155589 0.153950 0.155689
qa: -0.2604 -0.4748 -0.2724 0.1079 -0.0158 -0.1127 -0.2823 -0.2738 -0.2302 0.3960 -0.0074 -0.2574 -0.2679 0.0495 -0.0657 -0.2944 -0.0455 0.1896 -0.0444 0.0445 -0.1723 -0.2135 -0.1475 -0.1542 -0.1775 0.1071 0.0937 0.0943 0.0926 0.1089 0.0870 0.0981 0.0907 0.0966 0.0655 0.1128 0.1019 0.0905 0.1075 0.1003 0.1229 0.1124 0.1569 0.1732 0.1156 0.1070 0.1372 0.1447 0.1556 0.1539 0.1557
va: 2.1150 2.0238 2.2676 3.6748 3.7803 3.8733 3.8761 3.9059 3.8424 4.1594 3.6043 3.9393 3.9304 3.8553 3.6219 3.9813 3.9262 3.6563 3.8134 3.5700 3.9316 3.8773 3.8784 3.8445 3.8537 1.0073 1.0266 1.0119 0.9984 1.0047 1.0053 1.0016 1.0039 0.9847 1.0079 1.0012 0.9965 1.0065 1.0007 0.9959 1.0082 1.0009 1.0199 0.9944 1.0083 1.0117 1.0048 1.0028 0.9908 0.9935 0.9917
dispcorr: -0.030937999 hartree
energy: -1079.777432470596
dipole: 10.68673 -10.68718 -0.00045 -19.05963 18.16266 -0.89697 5.46966 -4.47088 0.99879
magnitude: 1.34243 au
magnitude: 3.41220 debye
