program: Orca
programVersion: 5.0.2
elementType: O O O C C C C C C C C C C C C C C C C C C C C C C H H H H H H H H H H H H H H H H H H H H H H H H H H
charge: 0
multiplicity: 1
keywords: wb97x-d3
keywords: def2-TZVPP
keywords: def2/J RIJCOSX
keywords: DEFGRID2
keywords: scfconv7
keywords: smallprint printgap noloewdin
keywords: NOSOSCF
formula: C22H26O3
InChI: InChI=1/C22H26O3/c1-15(2)10-19-20(22(19,3)4)21(23)25-14-17-12-18(24-13-17)11-16-8-6-5-7-9-16/h5-10,12-13,19-20H,11,14H2,1-4H3
51 atoms
O  2.283345 1.597851 0.195903
O  2.13777 2.073888 -1.980245
O  -1.830561 2.002993 1.432844
C  3.439037 -1.102886 -0.439129
C  2.003161 -1.290689 -0.817658
C  2.785704 -0.104369 -1.37249
C  3.830815 -0.769315 0.97973
C  4.437817 -2.016454 -1.112872
C  0.86854 -1.112933 0.128677
C  2.37995 1.288213 -1.091146
C  0.525112 -2.000302 1.065116
C  -0.664642 -1.781038 1.947689
C  1.279095 -3.269281 1.31727
C  1.61914 2.820854 0.565804
C  0.152819 2.585072 0.626922
C  -0.771332 2.44336 -0.460405
C  -0.55544 2.304185 1.745668
C  -1.955205 2.07979 0.086057
C  -3.252537 1.655401 -0.499734
C  -3.373608 0.14768 -0.503926
C  -4.227448 -0.508046 0.375778
C  -2.590111 -0.612176 -1.37027
C  -4.303475 -1.896006 0.386476
C  -2.661968 -1.996738 -1.361089
C  -3.52042 -2.644196 -0.48041
H  1.828659 -2.055149 -1.571772
H  3.06547 -0.205523 -2.415048
H  3.044266 -0.290983 1.555464
H  4.097815 -1.691238 1.501133
H  4.709755 -0.122128 1.001751
H  5.431218 -1.563646 -1.140623
H  4.520498 -2.960285 -0.569188
H  4.152071 -2.251119 -2.139377
H  0.24514 -0.232199 0.008184
H  -1.373464 -2.609275 1.868566
H  -1.194429 -0.858318 1.710208
H  -0.364952 -1.733138 2.998663
H  0.621837 -4.135303 1.199554
H  1.650053 -3.30458 2.345057
H  2.12853 -3.404062 0.64959
H  1.886541 3.629228 -0.11452
H  2.009851 3.067566 1.551626
H  -0.573976 2.579163 -1.511798
H  -0.287298 2.286903 2.791124
H  -3.310425 2.039971 -1.519535
H  -4.084524 2.096894 0.054056
H  -4.84113 0.068545 1.058116
H  -1.914277 -0.11496 -2.05717
H  -4.974496 -2.391936 1.076568
H  -2.047357 -2.572002 -2.042072
H  -3.57783 -3.725223 -0.472187
elementType: O C H
totalener: -1079.74602398 hartree
nucrepener: 2278.14106457 hartree
electener: -3357.88708855 hartree
oneelecener: -5995.61294376 hartree
twoeener: 2637.72585521 hartree
cpcmener: -0.02519025 hartree
kineticenergy: 1074.85929068 hartree
xcener: -106.464138564999 hartree
chargesum: 0.0000000
charge: -0.262950 -0.473574 -0.272028 0.107774 -0.016380 -0.110998 -0.283621 -0.273934 -0.220254 0.395976 -0.009748 -0.263994 -0.266144 0.049623 -0.067647 -0.291724 -0.044145 0.193846 -0.047060 0.043206 -0.177057 -0.206518 -0.149732 -0.159584 -0.170751 0.107030 0.093240 0.094732 0.092871 0.109145 0.098304 0.090789 0.087177 0.089957 0.099463 0.069947 0.113288 0.107195 0.100002 0.090364 0.122714 0.111745 0.157727 0.173079 0.116164 0.106494 0.137201 0.144029 0.155543 0.153708 0.155506
qa: -0.2629 -0.4736 -0.2720 0.1078 -0.0164 -0.1110 -0.2836 -0.2739 -0.2203 0.3960 -0.0097 -0.2640 -0.2661 0.0496 -0.0676 -0.2917 -0.0441 0.1938 -0.0471 0.0432 -0.1771 -0.2065 -0.1497 -0.1596 -0.1708 0.1070 0.0932 0.0947 0.0929 0.1091 0.0983 0.0908 0.0872 0.0900 0.0995 0.0699 0.1133 0.1072 0.1000 0.0904 0.1227 0.1117 0.1577 0.1731 0.1162 0.1065 0.1372 0.1440 0.1555 0.1537 0.1555
va: 2.1114 2.0250 2.2690 3.6802 3.7687 3.8743 3.8783 3.9055 3.8298 4.1589 3.6122 3.9384 3.9269 3.8577 3.6256 3.9706 3.9271 3.6540 3.8127 3.5749 3.9263 3.8730 3.8750 3.8529 3.8537 1.0074 1.0266 1.0123 0.9984 1.0040 1.0016 1.0037 1.0053 0.9862 0.9964 1.0091 1.0011 1.0006 0.9961 1.0068 1.0087 1.0007 1.0196 0.9944 1.0077 1.0138 1.0048 1.0030 0.9910 0.9936 0.9916
dispcorr: -0.031182824 hartree
energy: -1079.777206801303
dipole: 10.38342 -10.43678 -0.05337 -19.15867 18.23934 -0.91933 5.68055 -4.68427 0.99628
magnitude: 1.35669 au
magnitude: 3.44843 debye
