program: Orca
programVersion: 5.0.2
elementType: O O O C C C C C C C C C C C C C C C C C C C C C C H H H H H H H H H H H H H H H H H H H H H H H H H H
charge: 0
multiplicity: 1
keywords: wb97x-d3
keywords: def2-TZVPP
keywords: def2/J RIJCOSX
keywords: DEFGRID2
keywords: scfconv7
keywords: smallprint printgap noloewdin
keywords: NOSOSCF
formula: C22H26O3
InChI: InChI=1/C22H26O3/c1-15(2)10-19-20(22(19,3)4)21(23)25-14-17-12-18(24-13-17)11-16-8-6-5-7-9-16/h5-10,12-13,19-20H,11,14H2,1-4H3
51 atoms
O  2.049513 1.7428 -0.992743
O  2.621165 1.179982 1.096124
O  -2.342552 2.378883 -0.519977
C  4.538428 -0.872168 -0.246914
C  3.235175 -1.571819 -0.082936
C  3.281804 -0.19156 -0.755297
C  5.292482 -0.340534 0.946739
C  5.455162 -1.379923 -1.335872
C  2.588876 -1.787579 1.233121
C  2.645339 0.956616 -0.091648
C  1.295281 -2.084476 1.382664
C  0.701413 -2.36438 2.728118
C  0.350525 -2.170466 0.218916
C  1.281802 2.861708 -0.528194
C  -0.135781 2.475101 -0.29779
C  -0.66339 1.538088 0.651686
C  -1.207247 2.942102 -0.979697
C  -2.004076 1.517497 0.467984
C  -3.0979 0.752085 1.114386
C  -3.902799 -0.093704 0.154258
C  -3.281863 -0.838082 -0.846986
C  -5.286715 -0.166425 0.277017
C  -4.027713 -1.639809 -1.698776
C  -6.036116 -0.969175 -0.57349
C  -5.40857 -1.708558 -1.565619
H  3.039579 -2.356839 -0.808937
H  3.155101 -0.200954 -1.831485
H  5.92086 0.503282 0.655006
H  4.658719 -0.010408 1.764661
H  5.95272 -1.118553 1.336037
H  4.89871 -1.75586 -2.195685
H  6.120679 -0.58996 -1.689741
H  6.077479 -2.196185 -0.962802
H  3.217931 -1.738994 2.116487
H  1.443876 -2.324104 3.525294
H  0.231909 -3.351809 2.753617
H  -0.087073 -1.643977 2.96372
H  0.37412 -3.165039 -0.235701
H  0.585891 -1.452203 -0.56711
H  -0.67964 -1.997771 0.532643
H  1.343838 3.60622 -1.321579
H  1.734276 3.291775 0.366245
H  -0.116771 0.954822 1.3755
H  -1.306847 3.65653 -1.78263
H  -3.770599 1.43118 1.646613
H  -2.644434 0.115842 1.879064
H  -2.205251 -0.79404 -0.966415
H  -5.786243 0.412076 1.045632
H  -3.528116 -2.212335 -2.47015
H  -7.112305 -1.011535 -0.462363
H  -5.990287 -2.332928 -2.231748
elementType: O C H
totalener: -1079.75014416 hartree
nucrepener: 2168.98806096 hartree
electener: -3248.73820512 hartree
oneelecener: -5777.25807622 hartree
twoeener: 2528.51987110 hartree
cpcmener: -0.02550037 hartree
kineticenergy: 1074.85759932 hartree
xcener: -106.462379334374 hartree
chargesum: 0.0000000
charge: -0.289274 -0.471582 -0.281622 0.131322 -0.029064 -0.091826 -0.298506 -0.262424 -0.252200 0.392065 -0.021176 -0.214557 -0.305007 0.074486 -0.065861 -0.327750 -0.040685 0.220960 -0.071314 0.067430 -0.224096 -0.174194 -0.173341 -0.153398 -0.168335 0.112823 0.092382 0.100119 0.094514 0.099182 0.086100 0.095492 0.094149 0.121537 0.087386 0.101711 0.087585 0.121158 0.099853 0.091975 0.114554 0.115885 0.167433 0.173572 0.108659 0.112681 0.145738 0.138566 0.155101 0.155925 0.155866
qa: -0.2893 -0.4716 -0.2816 0.1313 -0.0291 -0.0918 -0.2985 -0.2624 -0.2522 0.3921 -0.0212 -0.2146 -0.3050 0.0745 -0.0659 -0.3277 -0.0407 0.2210 -0.0713 0.0674 -0.2241 -0.1742 -0.1733 -0.1534 -0.1683 0.1128 0.0924 0.1001 0.0945 0.0992 0.0861 0.0955 0.0941 0.1215 0.0874 0.1017 0.0876 0.1212 0.0999 0.0920 0.1146 0.1159 0.1674 0.1736 0.1087 0.1127 0.1457 0.1386 0.1551 0.1559 0.1559
va: 2.1103 2.0115 2.2789 3.7607 3.8069 3.8487 3.8958 3.8960 3.8262 4.1047 3.6949 3.9189 3.9615 3.8617 3.6927 3.9867 3.9711 3.6166 3.8395 3.5753 3.9373 3.9346 3.9401 3.8955 3.9035 1.0018 1.0318 1.0003 1.0182 0.9983 1.0048 1.0025 1.0021 1.0013 1.0091 0.9945 0.9956 0.9983 0.9957 0.9968 0.9980 1.0105 1.0119 0.9953 1.0079 1.0023 0.9997 1.0030 0.9926 0.9912 0.9907
dispcorr: -0.026229316 hartree
energy: -1079.776373472482
dipole: 14.58658 -14.64295 -0.05638 -15.68249 15.26079 -0.42170 4.16352 -4.80623 -0.64271
magnitude: 0.77077 au
magnitude: 1.95915 debye
