program: Orca
programVersion: 5.0.2
elementType: O O O C C C C C C C C C C C C C C C C C C C C C C H H H H H H H H H H H H H H H H H H H H H H H H H H
charge: 0
multiplicity: 1
keywords: wb97x-d3
keywords: def2-TZVPP
keywords: def2/J RIJCOSX
keywords: DEFGRID2
keywords: scfconv7
keywords: smallprint printgap noloewdin
keywords: NOSOSCF
formula: C22H26O3
InChI: InChI=1/C22H26O3/c1-15(2)10-19-20(22(19,3)4)21(23)25-14-17-12-18(24-13-17)11-16-8-6-5-7-9-16/h5-10,12-13,19-20H,11,14H2,1-4H3
51 atoms
O  2.390843 1.707918 0.104317
O  1.902345 1.748564 -2.071946
O  -1.677346 1.988185 1.456791
C  3.637736 -1.004702 -0.169515
C  2.212363 -1.382545 -0.454363
C  2.866852 -0.211891 -1.197416
C  4.029002 -0.464277 1.18501
C  4.698338 -1.909992 -0.756075
C  1.117439 -1.180348 0.517168
C  2.341089 1.16707 -1.1053
C  0.280004 -2.124372 0.962382
C  -0.796643 -1.782382 1.948625
C  0.322961 -3.568817 0.568827
C  1.671454 2.932169 0.347045
C  0.221853 2.646105 0.515896
C  -0.78055 2.508359 -0.498178
C  -0.390145 2.318525 1.679216
C  -1.908942 2.098547 0.126562
C  -3.236774 1.670517 -0.379463
C  -3.358081 0.163616 -0.460701
C  -2.464107 -0.572029 -1.236836
C  -4.36447 -0.512602 0.220087
C  -2.580276 -1.9497 -1.337698
C  -4.481922 -1.894561 0.123813
C  -3.591643 -2.617241 -0.656705
H  2.097131 -2.254134 -1.089757
H  3.111886 -0.444863 -2.227836
H  4.859594 0.239444 1.104544
H  3.223004 0.027632 1.721635
H  4.367642 -1.294326 1.808991
H  4.406063 -2.304214 -1.730576
H  5.642693 -1.376348 -0.88476
H  4.885233 -2.761035 -0.097915
H  0.979831 -0.181361 0.914516
H  -0.819595 -0.718673 2.185238
H  -0.661581 -2.332934 2.884105
H  -1.782221 -2.061586 1.566193
H  -0.651522 -3.897671 0.197669
H  0.543839 -4.192306 1.440006
H  1.065152 -3.800569 -0.192921
H  1.860122 3.655601 -0.4462
H  2.100847 3.321877 1.268382
H  -0.670512 2.682546 -1.556397
H  -0.04582 2.280028 2.701603
H  -3.371749 2.103035 -1.373346
H  -4.035291 2.073723 0.247933
H  -1.66797 -0.064364 -1.769718
H  -5.066319 0.043891 0.830562
H  -1.878436 -2.503694 -1.948515
H  -5.271546 -2.404847 0.66106
H  -3.681221 -3.693507 -0.733185
elementType: O C H
totalener: -1079.74716670 hartree
nucrepener: 2269.20725484 hartree
electener: -3348.95442154 hartree
oneelecener: -5977.80589537 hartree
twoeener: 2628.85147383 hartree
cpcmener: -0.02529514 hartree
kineticenergy: 1074.85224445 hartree
xcener: -106.464092840984 hartree
chargesum: 0.0000000
charge: -0.266800 -0.471546 -0.271636 0.147040 0.015942 -0.132764 -0.269096 -0.271920 -0.287471 0.398586 -0.038440 -0.238615 -0.254266 0.056914 -0.052824 -0.304572 -0.053959 0.207071 -0.055172 0.035654 -0.209766 -0.187765 -0.152686 -0.133917 -0.174876 0.110941 0.097271 0.101535 0.090107 0.092108 0.087240 0.094578 0.093759 0.107706 0.090398 0.111196 0.077560 0.087476 0.103201 0.089419 0.122026 0.112156 0.159812 0.173996 0.115199 0.103305 0.140110 0.138703 0.157637 0.154805 0.154641
qa: -0.2668 -0.4715 -0.2716 0.1470 0.0159 -0.1328 -0.2691 -0.2719 -0.2875 0.3986 -0.0384 -0.2386 -0.2543 0.0569 -0.0528 -0.3046 -0.0540 0.2071 -0.0552 0.0357 -0.2098 -0.1878 -0.1527 -0.1339 -0.1749 0.1109 0.0973 0.1015 0.0901 0.0921 0.0872 0.0946 0.0938 0.1077 0.0904 0.1112 0.0776 0.0875 0.1032 0.0894 0.1220 0.1122 0.1598 0.1740 0.1152 0.1033 0.1401 0.1387 0.1576 0.1548 0.1546
va: 2.1200 2.0235 2.2655 3.6783 3.7502 3.8931 3.8975 3.9067 3.8138 4.1448 3.7227 3.9170 3.9284 3.8559 3.5995 3.9962 3.9228 3.6312 3.8317 3.6174 3.8745 3.9422 3.8389 3.8673 3.8688 1.0030 1.0259 1.0032 1.0073 1.0019 1.0051 1.0017 1.0020 1.0176 1.0086 1.0024 0.9986 0.9992 0.9974 1.0122 1.0056 1.0011 1.0175 0.9964 1.0045 1.0147 1.0100 1.0035 0.9904 0.9913 0.9931
dispcorr: -0.030304916 hartree
energy: -1079.777471617150
dipole: 9.22193 -9.13578 0.08615 -18.47695 17.84746 -0.62948 5.37603 -4.41509 0.96093
magnitude: 1.15198 au
magnitude: 2.92811 debye
