program: Orca
programVersion: 5.0.2
elementType: O O O C C C C C C C C C C C C C C C C C C C C C C H H H H H H H H H H H H H H H H H H H H H H H H H H
charge: 0
multiplicity: 1
keywords: wb97x-d3
keywords: def2-TZVPP
keywords: def2/J RIJCOSX
keywords: DEFGRID2
keywords: scfconv7
keywords: smallprint printgap noloewdin
keywords: NOSOSCF
formula: C22H26O3
InChI: InChI=1/C22H26O3/c1-15(2)10-19-20(22(19,3)4)21(23)25-14-17-12-18(24-13-17)11-16-8-6-5-7-9-16/h5-10,12-13,19-20H,11,14H2,1-4H3
51 atoms
O  2.16266 1.998592 0.04751
O  1.793955 0.22939 1.364773
O  -1.978943 3.370556 -0.782313
C  4.242459 -1.013892 -0.118845
C  3.023575 -1.44408 -0.855829
C  3.233413 0.039921 -0.541702
C  4.43235 -1.369941 1.334569
C  5.541139 -0.988902 -0.890601
C  1.950827 -2.248452 -0.221779
C  2.333914 0.721956 0.402449
C  0.681917 -2.283825 -0.634007
C  -0.330363 -3.159312 0.036783
C  0.164952 -1.453215 -1.768876
C  1.258627 2.808587 0.813437
C  -0.116787 2.753737 0.251978
C  -1.051401 1.664475 0.280106
C  -0.741135 3.75398 -0.410114
C  -2.162823 2.095969 -0.362437
C  -3.480077 1.47974 -0.683843
C  -3.642563 0.104088 -0.096062
C  -3.702031 -0.075463 1.284931
C  -3.75567 -1.011834 -0.919175
C  -3.865935 -1.341087 1.828111
C  -3.929787 -2.280028 -0.378638
C  -3.982948 -2.448553 0.996955
H  3.174166 -1.65194 -1.91215
H  3.532737 0.654748 -1.382603
H  3.509863 -1.40797 1.906775
H  4.909731 -2.348962 1.412967
H  5.092126 -0.647138 1.818972
H  6.023088 -1.968434 -0.858207
H  5.389028 -0.730754 -1.939692
H  6.238089 -0.262673 -0.467279
H  2.238094 -2.877396 0.615791
H  0.115662 -3.789614 0.806438
H  -0.835019 -3.809705 -0.682821
H  -1.110539 -2.555217 0.507294
H  0.821393 -0.622745 -2.02642
H  -0.819026 -1.041356 -1.533311
H  0.033578 -2.060898 -2.669432
H  1.652678 3.822168 0.746952
H  1.275174 2.513734 1.863098
H  -0.907857 0.696627 0.732458
H  -0.440073 4.757398 -0.670127
H  -3.604207 1.431487 -1.769819
H  -4.279431 2.133812 -0.318923
H  -3.620262 0.782618 1.942101
H  -3.712761 -0.889063 -1.99514
H  -3.906883 -1.463165 2.90314
H  -4.01737 -3.136412 -1.03522
H  -4.112908 -3.436169 1.420891
elementType: O C H
totalener: -1079.74982198 hartree
nucrepener: 2211.81594785 hartree
electener: -3291.56576983 hartree
oneelecener: -5863.37964686 hartree
twoeener: 2571.81387703 hartree
cpcmener: -0.02428370 hartree
kineticenergy: 1074.86403189 hartree
xcener: -106.465904955859 hartree
chargesum: -0.0000000
charge: -0.290379 -0.470920 -0.281431 0.133001 -0.026118 -0.104647 -0.302480 -0.263458 -0.238931 0.399618 -0.012600 -0.224071 -0.272201 0.077568 -0.100773 -0.303602 -0.041288 0.215100 -0.018430 0.060558 -0.246167 -0.229194 -0.104298 -0.133006 -0.194006 0.113277 0.093020 0.097222 0.099570 0.098694 0.093730 0.085693 0.095254 0.119423 0.095478 0.098120 0.069407 0.100198 0.065298 0.117577 0.113282 0.114845 0.163457 0.173300 0.100441 0.112885 0.144750 0.140823 0.156669 0.154922 0.154819
qa: -0.2904 -0.4709 -0.2814 0.1330 -0.0261 -0.1046 -0.3025 -0.2635 -0.2389 0.3996 -0.0126 -0.2241 -0.2722 0.0776 -0.1008 -0.3036 -0.0413 0.2151 -0.0184 0.0606 -0.2462 -0.2292 -0.1043 -0.1330 -0.1940 0.1133 0.0930 0.0972 0.0996 0.0987 0.0937 0.0857 0.0953 0.1194 0.0955 0.0981 0.0694 0.1002 0.0653 0.1176 0.1133 0.1148 0.1635 0.1733 0.1004 0.1129 0.1448 0.1408 0.1567 0.1549 0.1548
va: 2.1129 2.0113 2.2770 3.7464 3.8285 3.8492 3.8972 3.8979 3.8381 4.0885 3.6698 3.9371 3.9365 3.8629 3.7437 3.9499 3.9786 3.6704 3.8264 3.5348 3.9500 3.8976 3.8333 3.8151 3.8840 1.0030 1.0307 1.0167 0.9980 1.0009 1.0021 1.0048 1.0025 1.0011 1.0132 0.9942 0.9987 1.0063 1.0133 1.0000 0.9976 1.0116 1.0103 0.9956 1.0116 1.0030 1.0014 1.0052 0.9895 0.9924 0.9926
dispcorr: -0.027986342 hartree
energy: -1079.777808323780
dipole: 12.06325 -11.92767 0.13558 -16.94130 17.15469 0.21339 -2.38887 1.63761 -0.75127
magnitude: 0.79266 au
magnitude: 2.01479 debye
