program: Orca
programVersion: 5.0.2
elementType: O O O C C C C C C C C C C C C C C C C C C C C C C H H H H H H H H H H H H H H H H H H H H H H H H H H
charge: 0
multiplicity: 1
keywords: wb97x-d3
keywords: def2-TZVPP
keywords: def2/J RIJCOSX
keywords: DEFGRID2
keywords: scfconv7
keywords: smallprint printgap noloewdin
keywords: NOSOSCF
formula: C22H26O3
InChI: InChI=1/C22H26O3/c1-15(2)10-19-20(22(19,3)4)21(23)25-14-17-12-18(24-13-17)11-16-8-6-5-7-9-16/h5-10,12-13,19-20H,11,14H2,1-4H3
51 atoms
O  2.185423 1.834751 -0.930617
O  2.280618 1.060187 1.163733
O  -2.024021 0.626345 -1.529315
C  4.968492 -0.241814 0.425109
C  3.966217 -1.145594 -0.209284
C  3.903863 0.365744 -0.459035
C  4.985949 -0.02562 1.91879
C  6.356701 -0.24258 -0.175256
C  2.900829 -1.840367 0.553884
C  2.730624 1.104945 0.049003
C  1.750923 -2.262026 0.026291
C  0.723325 -2.968475 0.854877
C  1.366407 -2.036422 -1.403823
C  0.969458 2.526258 -0.632796
C  -0.21937 1.634365 -0.717232
C  -0.713721 0.704257 0.253915
C  -1.062432 1.532296 -1.771943
C  -1.807083 0.124008 -0.29376
C  -2.764392 -0.896847 0.204825
C  -4.17368 -0.369475 0.328472
C  -5.179815 -0.819902 -0.514925
C  -4.482446 0.589816 1.28829
C  -6.472842 -0.327702 -0.402114
C  -5.771623 1.082143 1.405708
C  -6.772224 0.624176 0.558971
H  4.325932 -1.693445 -1.076479
H  4.229352 0.685562 -1.442344
H  5.434488 0.94058 2.155588
H  4.002928 -0.047244 2.376998
H  5.601234 -0.79569 2.388535
H  6.861942 0.707476 0.007664
H  6.965288 -1.03377 0.266208
H  6.33785 -0.404961 -1.253879
H  3.082138 -2.019232 1.608302
H  1.037393 -3.081836 1.891725
H  0.505857 -3.962547 0.456266
H  -0.219672 -2.415547 0.846466
H  1.05483 -2.970231 -1.878312
H  2.167386 -1.605305 -2.00108
H  0.51386 -1.353759 -1.459638
H  0.904609 3.310539 -1.386581
H  1.032053 3.004294 0.346042
H  -0.291966 0.496939 1.223277
H  -1.097293 2.034011 -2.725908
H  -2.405542 -1.239867 1.178061
H  -2.755258 -1.773357 -0.450249
H  -4.951238 -1.563093 -1.269344
H  -3.703139 0.957605 1.945703
H  -7.245796 -0.688879 -1.067856
H  -5.997364 1.825391 2.159241
H  -7.779547 1.008737 0.649519
totalener: -1079.72879158 hartree
nucrepener: 2164.76512585 hartree
electener: -3244.49391743 hartree
oneelecener: -5767.98737601 hartree
twoeener: 2523.49345857 hartree
kineticenergy: 1074.91892332 hartree
xcener: -106.469784878585 hartree
chargesum: -0.0000000
charge: -0.262909 -0.398897 -0.253813 0.141452 -0.062356 -0.114337 -0.276094 -0.244836 -0.165394 0.376022 -0.006957 -0.202546 -0.253877 0.049704 -0.050438 -0.302454 -0.028294 0.235520 -0.123344 0.066551 -0.144503 -0.162056 -0.134103 -0.135852 -0.122392 0.090212 0.079274 0.085207 0.101935 0.086731 0.090035 0.088391 0.070166 0.083382 0.082886 0.089804 0.057741 0.094216 0.084652 0.095332 0.095703 0.111469 0.150269 0.133840 0.113025 0.102785 0.102591 0.115738 0.122466 0.123768 0.124586
qa: -0.2629 -0.3989 -0.2538 0.1415 -0.0624 -0.1143 -0.2761 -0.2448 -0.1654 0.3760 -0.0070 -0.2025 -0.2539 0.0497 -0.0504 -0.3025 -0.0283 0.2355 -0.1233 0.0666 -0.1445 -0.1621 -0.1341 -0.1359 -0.1224 0.0902 0.0793 0.0852 0.1019 0.0867 0.0900 0.0884 0.0702 0.0834 0.0829 0.0898 0.0577 0.0942 0.0847 0.0953 0.0957 0.1115 0.1503 0.1338 0.1130 0.1028 0.1026 0.1157 0.1225 0.1238 0.1246
va: 2.1191 2.0843 2.3060 3.7420 3.8932 3.8478 3.9050 3.9034 3.8707 4.1375 3.7474 3.9380 3.9649 3.9172 3.6867 3.9689 3.9878 3.5169 3.8314 3.6556 4.0037 3.9908 3.9730 3.9753 3.9511 1.0056 1.0327 1.0050 1.0222 0.9977 1.0051 1.0046 1.0070 1.0138 1.0126 1.0016 1.0033 1.0025 1.0103 0.9877 0.9967 1.0067 1.0256 1.0085 1.0052 1.0042 1.0132 1.0110 1.0014 1.0011 0.9998
dispcorr: -0.026704190 hartree
energy: -1079.755495774429
dipole: 16.61502 -16.53619 0.07883 -11.61613 11.54318 -0.07295 3.37964 -3.83114 -0.45150
magnitude: 0.46410 au
magnitude: 1.17964 debye
