program: Orca
programVersion: 5.0.2
elementType: O O O C C C C C C C C C C C C C C C C C C C C C C H H H H H H H H H H H H H H H H H H H H H H H H H H
charge: 0
multiplicity: 1
keywords: wb97x-d3
keywords: def2-TZVPP
keywords: def2/J RIJCOSX
keywords: DEFGRID2
keywords: scfconv7
keywords: smallprint printgap noloewdin
keywords: NOSOSCF
formula: C22H26O3
InChI: InChI=1/C22H26O3/c1-15(2)10-19-20(22(19,3)4)21(23)25-14-17-12-18(24-13-17)11-16-8-6-5-7-9-16/h5-10,12-13,19-20H,11,14H2,1-4H3
51 atoms
O  2.192939 2.007215 0.184834
O  2.273078 0.189037 1.483869
O  -2.131905 1.579155 -0.834312
C  4.951276 -0.492299 0.121422
C  3.924061 -0.927491 -0.867061
C  3.870856 0.48747 -0.27794
C  5.008343 -1.096737 1.503414
C  6.323237 -0.17027 -0.427162
C  2.876889 -1.93063 -0.557164
C  2.720076 0.841963 0.577295
C  1.728052 -2.052295 -1.22325
C  0.727518 -3.106786 -0.862626
C  1.322165 -1.146573 -2.344655
C  1.000943 2.443861 0.843844
C  -0.223433 1.814007 0.27767
C  -0.6939 0.468823 0.430752
C  -1.144828 2.427724 -0.501821
C  -1.8512 0.386586 -0.266521
C  -2.820804 -0.718243 -0.483312
C  -4.167495 -0.449655 0.14448
C  -5.283594 -0.187799 -0.638241
C  -4.305605 -0.450707 1.529025
C  -6.517174 0.062776 -0.052961
C  -5.534847 -0.203555 2.117039
C  -6.646369 0.054003 1.326284
H  4.255092 -0.931264 -1.90221
H  4.176597 1.280398 -0.950615
H  5.487699 -0.405132 2.198171
H  4.034883 -1.345391 1.912963
H  5.612728 -2.005872 1.477193
H  6.840173 0.54961 0.209911
H  6.936714 -1.071963 -0.477508
H  6.275098 0.25105 -1.432528
H  3.073265 -2.615174 0.260933
H  0.522397 -3.765998 -1.709809
H  -0.227395 -2.652908 -0.583389
H  1.061079 -3.723739 -0.02928
H  1.093273 -1.718828 -3.247162
H  2.08173 -0.409462 -2.596175
H  0.414076 -0.600318 -2.076599
H  0.972902 3.521897 0.686007
H  1.073087 2.262134 1.917319
H  -0.218813 -0.323661 0.98461
H  -1.22308 3.434623 -0.880048
H  -2.386285 -1.627048 -0.06064
H  -2.943415 -0.906841 -1.553945
H  -5.189319 -0.178443 -1.717405
H  -3.439445 -0.641959 2.151668
H  -7.377336 0.265545 -0.677383
H  -5.627267 -0.211865 3.195223
H  -7.607244 0.247204 1.784702
totalener: -1079.72902246 hartree
nucrepener: 2157.28548474 hartree
electener: -3237.01450720 hartree
oneelecener: -5753.00113313 hartree
twoeener: 2515.98662593 hartree
kineticenergy: 1074.91707615 hartree
xcener: -106.469437114595 hartree
chargesum: 0.0000000
charge: -0.264172 -0.401341 -0.254696 0.143952 -0.063815 -0.112159 -0.280028 -0.243637 -0.155747 0.375069 -0.024994 -0.199708 -0.251246 0.057631 -0.031990 -0.343195 -0.039333 0.261668 -0.128328 0.070684 -0.149208 -0.162419 -0.127923 -0.132098 -0.126693 0.090389 0.080699 0.085222 0.103120 0.087465 0.090416 0.087950 0.070043 0.083379 0.090234 0.056760 0.083853 0.095411 0.083485 0.093693 0.093074 0.111942 0.154368 0.134121 0.115330 0.101326 0.104217 0.115765 0.122560 0.124349 0.124555
qa: -0.2642 -0.4013 -0.2547 0.1440 -0.0638 -0.1122 -0.2800 -0.2436 -0.1557 0.3751 -0.0250 -0.1997 -0.2512 0.0576 -0.0320 -0.3432 -0.0393 0.2617 -0.1283 0.0707 -0.1492 -0.1624 -0.1279 -0.1321 -0.1267 0.0904 0.0807 0.0852 0.1031 0.0875 0.0904 0.0879 0.0700 0.0834 0.0902 0.0568 0.0839 0.0954 0.0835 0.0937 0.0931 0.1119 0.1544 0.1341 0.1153 0.1013 0.1042 0.1158 0.1226 0.1243 0.1246
va: 2.1223 2.0797 2.3125 3.7396 3.8896 3.8581 3.9066 3.9028 3.8695 4.1328 3.7569 3.9377 3.9523 3.9141 3.7112 4.0027 4.0105 3.5221 3.8589 3.6532 4.0082 3.9925 3.9665 3.9733 3.9551 1.0053 1.0321 1.0049 1.0221 0.9977 1.0051 1.0047 1.0071 1.0139 1.0018 1.0056 1.0118 1.0019 1.0109 0.9949 0.9968 1.0063 1.0210 1.0081 1.0070 1.0065 1.0128 1.0103 1.0012 1.0009 0.9998
dispcorr: -0.026227057 hartree
energy: -1079.755249517671
dipole: 16.73784 -16.61699 0.12085 -12.41351 12.57847 0.16497 -3.96769 3.52731 -0.44038
magnitude: 0.48554 au
magnitude: 1.23415 debye
