program: Gaussian 09
title: 000062156
version: EM64L-G09RevD.01
frameworkgroup: C1[X(C24H30N2O3)]
method: RPBEPBE
basis: SDD
operation: Freq
keyword: #p
keyword: freq=noraman
keyword: PBEPBE/SDD
title: #p freq=noraman PBEPBE/SDD
converged: YES YES NO NO
title: Mulliken charges:
elementType: O O O N N C C C C C C C C C C C C C C C C C C C C C C C C H H H H H H H H H H H H H H H H H H H H H H H H H H H H H H
charge: -0.261288 -0.256052 -0.281049 -0.062655 -0.308092 0.257962 -0.498970 -0.436062 -0.410924 -0.392169 -0.345211 0.211873 0.352354 -0.577864 0.251401 -0.496643 0.498657 -0.369577 -0.358372 -0.681140 -0.508728 -0.211669 -0.216843 -0.420128 -0.409211 -0.234283 -0.227829 -0.230162 -0.244184 0.241381 0.237090 0.197014 0.252712 0.195373 0.214105 0.199688 0.228739 0.192493 0.220597 0.214516 0.219848 0.247192 0.241240 0.253511 0.292650 0.236561 0.221998 0.208612 0.227455 0.238254 0.254724 0.230719 0.232150 0.232039 0.232806 0.231197 0.222933 0.222674 0.226588
chargesum: 0.00000
title: Mulliken charges with hydrogens summed into heavy atoms:
elementType: O O O N N C C C C C C C C C C C C C C C C C C C C C C C C
charge: -0.261288 -0.256052 -0.281049 -0.062655 -0.308092 0.257962 -0.020499 0.013664 -0.001446 0.036257 0.067879 0.211873 0.352354 -0.143500 0.251401 -0.008211 0.498657 -0.116065 -0.065722 -0.013970 0.211705 0.019050 0.015307 -0.188089 -0.176405 -0.003085 -0.004896 -0.007488 -0.017596
polarizability: 3.26934442e+02 1.89615473e+01 2.92330341e+02 -2.40047715e+00 1.21646762e+01 2.09757358e+02
1716.lowfreq: -8.5890 -2.9031 -0.0005 0.0004 0.0006 4.4503 13.6225 18.5274 22.2434
frequency: 13.2758 18.4719 21.5641 27.4628 37.9519 49.8883 57.0524 61.0562 67.7978 73.6211 89.3950 97.1264 107.3216 119.3147 126.3348 150.6030 166.1550 183.6229 193.2023 210.5208 232.2688 249.4134 253.6886 271.5528 286.5909 293.9525 308.9476 323.1034 334.3996 366.2416 379.8303 389.9057 403.5499 412.4535 421.1266 450.6900 483.7913 494.1572 508.9102 538.6566 554.2573 583.3685 600.3440 617.6755 618.0087 633.8646 658.8464 687.1232 705.4305 708.7356 739.8791 754.9367 760.5901 768.8070 792.0066 796.8410 800.8523 811.5267 829.1065 853.7602 860.7104 862.4567 917.0578 936.4916 937.7718 943.4719 958.8883 975.3415 975.7477 988.2239 989.8109 990.0464 992.8325 1003.4852 1007.8803 1014.6800 1021.2780 1024.0748 1026.7267 1029.9098 1047.2707 1063.9944 1072.8557 1079.0695 1087.3036 1092.0618 1103.0940 1113.2645 1124.3571 1136.8903 1150.5344 1162.1731 1171.4587 1171.4996 1174.4709 1178.5414 1186.2023 1186.2765 1211.2928 1216.3013 1235.0577 1253.1581 1253.5495 1277.0424 1285.1463 1288.7913 1301.4943 1306.1229 1309.5779 1324.8478 1327.4177 1334.9115 1345.6687 1360.4110 1364.2094 1371.6862 1382.3705 1390.3828 1395.4299 1418.3546 1434.7653 1439.8986 1444.3776 1447.8706 1451.0890 1458.3726 1462.8888 1464.5765 1467.0113 1472.5815 1477.6481 1478.8855 1480.5789 1483.5733 1488.0365 1574.3408 1588.6514 1592.5768 1606.6599 1610.7322 1614.2835 2844.5160 2857.4535 2911.9484 2986.5931 2997.0472 2997.1965 3001.8700 3005.7967 3009.6024 3015.1451 3029.3317 3035.6549 3036.2555 3061.6070 3079.2615 3090.1940 3091.6993 3104.8581 3110.9418 3113.6258 3113.8922 3127.1059 3130.4745 3133.9081 3141.6842 3144.7943 3147.7319 3153.3809 3160.9146 3166.9059
redmass: 4.7385 4.4258 4.0039 4.0029 2.5540 4.2736 2.6877 3.8785 3.0811 3.8152 3.2610 2.4591 1.7723 3.2020 5.5152 3.0852 3.5436 1.2976 4.6535 2.8312 3.5896 5.2435 3.7920 2.7138 3.8778 3.6108 2.7252 3.6910 2.5206 2.2215 2.9163 6.6034 2.8212 2.9002 4.2767 4.8355 3.2159 3.6286 3.0756 4.1026 3.0332 3.5706 3.5903 6.2715 5.9909 4.9135 4.0610 6.8205 1.7718 1.8137 3.7528 2.2252 2.5263 3.0631 1.3064 2.1530 1.4949 1.6404 2.9832 1.2483 1.2451 3.6123 1.4859 2.0371 2.4136 3.4604 2.3835 1.5451 2.2451 1.5529 3.8114 6.0823 1.3260 1.3346 2.5475 1.7630 1.9727 1.9885 2.1340 1.8936 3.0733 2.3784 1.5507 1.6007 1.6070 2.8894 2.5396 1.3151 2.7052 3.1197 1.4930 1.9762 1.0574 1.0572 2.1823 1.2172 1.1117 1.1228 2.0262 2.3974 3.4866 1.1916 1.4718 1.2711 1.4781 2.2307 1.5238 1.4700 1.4896 1.3090 1.3052 1.3229 1.4728 2.3828 1.3707 7.9531 7.5236 1.4042 1.2125 1.1939 2.1878 2.1774 1.1047 1.0877 1.0506 1.0968 1.0898 1.0529 1.0398 1.0828 1.1472 1.5035 1.3976 2.1555 1.1030 7.6178 6.3654 6.0522 6.2802 9.1530 6.1804 1.0705 1.0705 1.0684 1.0607 1.0610 1.0374 1.0645 1.0290 1.0636 1.0855 1.0849 1.0899 1.0972 1.1029 1.1031 1.0980 1.1000 1.0999 1.1047 1.0856 1.0880 1.0849 1.0908 1.0885 1.0959 1.0929 1.1052 1.0971 1.1015 1.1017
irintensity: 0.1161 0.7919 0.0949 0.0553 0.1396 1.6223 0.1343 1.8611 2.6821 0.0563 1.4859 1.8116 1.2475 0.9619 0.9424 0.2950 0.5002 1.4443 1.9516 3.9830 1.5114 6.3164 1.2679 1.0143 11.1624 1.5738 2.9530 11.2989 3.0426 2.5746 1.0922 22.9329 0.0112 0.1124 7.6266 1.7516 4.8490 1.1164 21.7365 3.8778 0.6938 11.7521 22.1286 0.5884 2.7331 5.0624 12.0118 11.2298 51.2562 58.9174 2.0396 33.4924 28.8598 14.1350 0.0639 9.3445 12.7618 0.9813 8.3659 0.0041 0.2318 1.5027 3.2957 4.5381 11.0096 9.7237 6.5924 3.3758 9.2032 0.0682 1.5636 0.0952 0.0354 0.3667 7.4472 3.0049 6.0506 14.9446 5.0140 11.5220 41.1744 9.1255 11.0836 0.9220 7.8066 11.1958 136.0442 3.3654 35.5420 39.1004 23.3504 16.5369 0.2961 0.2901 75.9685 11.0665 0.0336 11.3319 10.4110 1.4506 146.6406 1.9113 48.6560 10.3756 8.3160 46.5336 28.2705 5.2501 12.9664 0.3463 0.3156 42.6693 24.4888 77.0261 7.7938 0.9912 0.3734 1.0756 28.3452 15.7960 7.7847 6.4368 24.2449 8.4877 11.6012 18.8328 5.0799 8.5620 12.0118 7.0934 7.7718 31.8577 55.3087 26.9707 9.1839 202.9725 5.8670 1.7288 6.5840 135.7969 10.7898 47.5873 122.8194 56.1634 24.9659 28.1326 30.4521 10.1262 37.3175 18.2425 16.5011 51.3211 36.6797 11.5987 26.4941 13.0043 9.0171 33.1289 26.8563 18.8942 13.4910 4.1131 0.8585 11.7410 5.1728 45.8459 14.2405 15.9101 17.5020 27.1635 22.3046
temp: 298.150 k
press: 1.00000 atm
elementType: 8 8 8 7 7 6 6 6 6 6 6 6 6 6 6 6 6 6 6 6 6 6 6 6 6 6 6 6 6 1 1 1 1 1 1 1 1 1 1 1 1 1 1 1 1 1 1 1 1 1 1 1 1 1 1 1 1 1 1
symmnumber: 1
zpe: 1289593.2 jmol-1
zpe.correction: 0.491180 hartree
zpe.thermalcorrener: 0.519919 hartree
zpe.thermalcorrenthalpy: 0.520863 hartree
zpe.thermalcorrgfe: 0.427676 hartree
zpe.sumelectzpe: -1265.567539 hartree
zpe.sumelectthermal: -1265.538801 hartree
zpe.sumelectthermalent: -1265.537857 hartree
zpe.sumelectthermalfe: -1265.631043 hartree
dipole: -0.1554 2.2883 0.4939
dipole: 2.3461
quadrupole: -167.7722 -157.9869 -171.9024
quadrupole: 15.9397 -3.3575 -2.0350
quadrupole: -1.8850 7.9002 -6.0152 15.9397 -3.3575 -2.0350
hfenergy: -1266.0587194 hartree
pointgroup: C01 [X(C24H30N2O3)]
dipole: 0.0452632 -0.9110787 0.1410103 debye
polarizability: 327.5600945|18.2117543|292.8383641|3.5693005|-7.2557188|208.6236822 unknown
InChI: InChI=1S/C24H30N2O3/c1-3-22(27)26(21-12-8-5-9-13-21)24(23(28)29-2)15-18-25(19-16-24)17-14-20-10-6-4-7-11-20/h4-13H,3,14-19H2,1-2H3
charge 0 multiplicity 1
59 atoms
O  -0.738769 2.783235 1.015599
O  -2.476114 1.667435 2.075665
O  -3.115469 2.347972 -0.901414
N  1.564072 -0.125407 0.081259
N  -2.716542 0.136064 -0.332905
C  -1.350123 0.547132 0.178504
C  -0.696664 -0.609381 0.991407
C  -0.435022 0.891789 -1.031096
C  0.776215 -0.304991 1.325026
C  1.058733 1.046948 -0.681459
C  3.022261 -0.063858 0.338075
C  -1.614679 1.719462 1.165144
C  -3.243418 -1.192823 -0.08549
C  3.866055 -0.341803 -0.936521
C  -3.527793 1.144861 -0.865335
C  -4.913143 0.741046 -1.377998
C  5.351741 -0.417979 -0.619488
C  -3.096592 -2.212767 -1.055436
C  -3.917458 -1.46071 1.131143
C  -5.619729 1.895038 -2.111602
C  -1.009022 3.951279 1.88912
C  -3.626108 -3.500239 -0.810201
C  -4.445285 -2.748605 1.372448
C  6.174718 0.735965 -0.688727
C  5.940477 -1.640699 -0.203109
C  -4.301881 -3.769773 0.403015
C  7.546443 0.672226 -0.353234
C  7.311018 -1.710751 0.133088
C  8.119961 -0.552553 0.060019
H  -1.266761 -0.793488 1.91913
H  -0.721367 -1.530281 0.382161
H  -0.53823 0.054195 -1.74722
H  -0.801837 1.811697 -1.514358
H  0.844935 0.588881 1.99785
H  1.194177 -1.163833 1.882066
H  1.622917 1.127836 -1.627883
H  1.214944 1.991973 -0.110517
H  3.33319 0.919882 0.775145
H  3.268621 -0.838933 1.089078
H  3.683731 0.452459 -1.684181
H  3.505159 -1.29224 -1.371246
H  -5.520339 0.407393 -0.51276
H  -4.823227 -0.146352 -2.032761
H  -2.571004 -1.991537 -1.99103
H  -4.008076 -0.655537 1.86925
H  -5.713936 2.776571 -1.455993
H  -5.047151 2.210179 -3.000893
H  -6.628617 1.581376 -2.435043
H  -0.205257 4.664862 1.659553
H  -0.992414 3.652786 2.950722
H  -1.997595 4.370815 1.64013
H  -3.511278 -4.288832 -1.562091
H  -4.966184 -2.954891 2.314038
H  5.738024 1.688506 -1.015033
H  5.319884 -2.544447 -0.151101
H  -4.712319 -4.767957 0.59194
H  8.167135 1.57345 -0.417351
H  7.748888 -2.665634 0.446257
H  9.183902 -0.605114 0.317344
