program: Orca
programVersion: 5.0.2
elementType: O O O C C C C C C C C C C C C C C C C C C C C C C H H H H H H H H H H H H H H H H H H H H H H H H H H
charge: 0
multiplicity: 1
keywords: wb97x-d3
keywords: def2-TZVPP
keywords: def2/J RIJCOSX
keywords: DEFGRID2
keywords: scfconv7
keywords: smallprint printgap noloewdin
keywords: NOSOSCF
formula: C22H26O3
InChI: InChI=1/C22H26O3/c1-15(2)10-19-20(22(19,3)4)21(23)25-14-17-12-18(24-13-17)11-16-8-6-5-7-9-16/h5-10,12-13,19-20H,11,14H2,1-4H3
51 atoms
O  1.653792 1.217161 -1.418138
O  2.780142 1.59126 0.474469
O  -1.274758 1.270633 1.852302
C  4.746659 -0.606595 -0.38079
C  3.539178 -1.399258 -0.00585
C  3.413262 -0.21488 -0.97093
C  5.456622 0.25256 0.637826
C  5.703112 -1.248157 -1.361304
C  2.931754 -1.355732 1.347641
C  2.624876 0.956322 -0.534992
C  1.65216 -1.626476 1.60872
C  1.113051 -1.591094 3.006199
C  0.647897 -1.963278 0.54965
C  0.722949 2.242621 -1.059826
C  -0.27975 1.767186 -0.06629
C  -1.534155 1.132321 -0.338942
C  -0.183121 1.815092 1.28337
C  -2.095462 0.855495 0.861556
C  -3.373898 0.208256 1.267248
C  -4.223757 -0.126601 0.072746
C  -4.265672 -1.418659 -0.435585
C  -4.962919 0.866529 -0.562377
C  -5.033492 -1.71703 -1.552446
C  -5.729296 0.573869 -1.679013
C  -5.76616 -0.72063 -2.177937
H  3.442142 -2.357398 -0.510112
H  3.255744 -0.484163 -2.009333
H  5.986647 1.067971 0.142619
H  4.79532 0.696413 1.374264
H  6.200708 -0.350634 1.162437
H  6.266996 -0.49035 -1.908656
H  6.420078 -1.884462 -0.838702
H  5.185187 -1.869207 -2.093974
H  3.584982 -1.100189 2.175245
H  0.297141 -0.868921 3.089583
H  1.877227 -1.321494 3.734239
H  0.70195 -2.562256 3.294543
H  1.071995 -1.986149 -0.451964
H  -0.160614 -1.228584 0.541208
H  0.188344 -2.935677 0.744615
H  0.232096 2.509189 -1.995148
H  1.250243 3.124049 -0.692726
H  -1.958403 0.915192 -1.306122
H  0.583699 2.179046 1.946084
H  -3.923455 0.870995 1.943429
H  -3.164533 -0.699273 1.842374
H  -3.691683 -2.201078 0.046449
H  -4.934348 1.879414 -0.178514
H  -5.059086 -2.729617 -1.933044
H  -6.301096 1.35686 -2.15956
H  -6.366202 -0.951148 -3.048148
totalener: -1079.72921762 hartree
nucrepener: 2182.11069789 hartree
electener: -3261.83991552 hartree
oneelecener: -5802.69360443 hartree
twoeener: 2540.85368892 hartree
kineticenergy: 1074.91213735 hartree
xcener: -106.469701564929 hartree
chargesum: 0.0000000
charge: -0.264802 -0.397198 -0.261427 0.145678 -0.060586 -0.112940 -0.274879 -0.246744 -0.178132 0.362986 -0.002990 -0.212815 -0.232185 0.052780 -0.079918 -0.228963 0.006449 0.143761 -0.054214 0.032474 -0.148697 -0.171832 -0.125900 -0.119721 -0.127950 0.090178 0.080724 0.084363 0.101783 0.086057 0.089738 0.088350 0.070338 0.083752 0.080527 0.078562 0.085591 0.085905 0.065568 0.096373 0.100074 0.114068 0.135791 0.151096 0.101937 0.088436 0.107010 0.114780 0.124879 0.125759 0.126130
qa: -0.2648 -0.3972 -0.2614 0.1457 -0.0606 -0.1129 -0.2749 -0.2467 -0.1781 0.3630 -0.0030 -0.2128 -0.2322 0.0528 -0.0799 -0.2290 0.0064 0.1438 -0.0542 0.0325 -0.1487 -0.1718 -0.1259 -0.1197 -0.1279 0.0902 0.0807 0.0844 0.1018 0.0861 0.0897 0.0883 0.0703 0.0838 0.0805 0.0786 0.0856 0.0859 0.0656 0.0964 0.1001 0.1141 0.1358 0.1511 0.1019 0.0884 0.1070 0.1148 0.1249 0.1258 0.1261
va: 2.1212 2.0864 2.2816 3.7390 3.8923 3.8366 3.9057 3.9034 3.8847 4.1689 3.7405 3.9344 3.9497 3.8810 3.6511 3.9521 3.9317 3.6692 3.8571 3.6522 3.9832 3.9833 3.9698 3.9526 3.9540 1.0059 1.0315 1.0056 1.0216 0.9975 1.0051 1.0046 1.0067 1.0133 1.0080 1.0116 0.9985 1.0131 1.0055 1.0038 0.9940 1.0087 1.0105 1.0175 1.0056 1.0097 1.0122 1.0101 1.0004 1.0000 0.9996
dispcorr: -0.027113668 hartree
energy: -1079.756331291825
dipole: 14.30030 -14.76417 -0.46388 -11.65820 11.28645 -0.37176 1.90914 -2.43529 -0.52615
magnitude: 0.79386 au
magnitude: 2.01784 debye
