program: Orca
programVersion: 5.0.2
elementType: O O O C C C C C C C C C C C C C C C C C C C C C C H H H H H H H H H H H H H H H H H H H H H H H H H H
charge: 0
multiplicity: 1
keywords: wb97x-d3
keywords: def2-TZVPP
keywords: def2/J RIJCOSX
keywords: DEFGRID2
keywords: scfconv7
keywords: smallprint printgap noloewdin
keywords: NOSOSCF
formula: C22H26O3
InChI: InChI=1/C22H26O3/c1-15(2)10-19-20(22(19,3)4)21(23)25-14-17-12-18(24-13-17)11-16-8-6-5-7-9-16/h5-10,12-13,19-20H,11,14H2,1-4H3
51 atoms
O  2.077477 1.879969 -1.020252
O  2.604794 1.164691 1.03186
O  -1.67298 1.82208 1.232619
C  4.152351 -1.135901 -0.325267
C  2.728194 -1.570342 -0.382829
C  3.127068 -0.176463 -0.886172
C  4.839331 -0.884706 0.995003
C  5.083727 -1.729592 -1.358854
C  1.87821 -1.736157 0.821147
C  2.605901 0.997666 -0.1595
C  0.545741 -1.678454 0.807027
C  -0.26039 -1.841177 2.058328
C  -0.250153 -1.392472 -0.428985
C  1.366445 2.980956 -0.450758
C  0.003159 2.575338 -0.010359
C  -1.173809 2.473429 -0.818735
C  -0.370067 2.159947 1.223028
C  -2.158663 2.012019 -0.013505
C  -3.575195 1.633866 -0.26293
C  -3.756765 0.136391 -0.347419
C  -3.925008 -0.626184 0.803137
C  -3.718686 -0.509197 -1.578009
C  -4.054379 -2.004647 0.725021
C  -3.852631 -1.886676 -1.661054
C  -4.019856 -2.639394 -0.508107
H  2.487585 -2.247824 -1.198458
H  3.132508 -0.056331 -1.963463
H  5.666265 -0.184799 0.863591
H  4.184758 -0.475395 1.757314
H  5.259372 -1.820517 1.369283
H  5.922394 -1.060716 -1.559946
H  5.491406 -2.679092 -1.007093
H  4.577056 -1.919799 -2.306225
H  2.380986 -1.911274 1.766002
H  -0.951555 -2.683511 1.974051
H  -0.876309 -0.955338 2.233443
H  0.366272 -1.999395 2.93529
H  0.314505 -1.546809 -1.3475
H  -0.589547 -0.352859 -0.43153
H  -1.15128 -2.007359 -0.473425
H  1.306841 3.718685 -1.250414
H  1.93074 3.42081 0.372493
H  -1.265146 2.709195 -1.867232
H  0.174029 2.044986 2.145505
H  -3.890022 2.09984 -1.198018
H  -4.217149 2.046361 0.520363
H  -3.95402 -0.138713 1.77005
H  -3.582979 0.071682 -2.482764
H  -4.185174 -2.583598 1.629912
H  -3.826283 -2.372851 -2.627497
H  -4.12471 -3.714477 -0.570378
totalener: -1079.72894041 hartree
nucrepener: 2251.86827822 hartree
electener: -3331.59721864 hartree
oneelecener: -5942.43577685 hartree
twoeener: 2610.83855821 hartree
kineticenergy: 1074.91188868 hartree
xcener: -106.470732623984 hartree
chargesum: -0.0000000
charge: -0.268649 -0.395558 -0.254799 0.142367 -0.058373 -0.095653 -0.277214 -0.244839 -0.155102 0.354767 0.023133 -0.235690 -0.243707 0.056839 -0.082266 -0.241509 0.004704 0.192784 -0.138714 0.095221 -0.157565 -0.166008 -0.139394 -0.117438 -0.130683 0.085569 0.075451 0.084492 0.102205 0.086163 0.090002 0.087267 0.069397 0.080704 0.085681 0.077062 0.085767 0.087779 0.070036 0.086606 0.099167 0.111456 0.121686 0.149480 0.097764 0.110552 0.113734 0.101979 0.125705 0.122693 0.124952
qa: -0.2686 -0.3956 -0.2548 0.1424 -0.0584 -0.0957 -0.2772 -0.2448 -0.1551 0.3548 0.0231 -0.2357 -0.2437 0.0568 -0.0823 -0.2415 0.0047 0.1928 -0.1387 0.0952 -0.1576 -0.1660 -0.1394 -0.1174 -0.1307 0.0856 0.0755 0.0845 0.1022 0.0862 0.0900 0.0873 0.0694 0.0807 0.0857 0.0771 0.0858 0.0878 0.0700 0.0866 0.0992 0.1115 0.1217 0.1495 0.0978 0.1106 0.1137 0.1020 0.1257 0.1227 0.1250
va: 2.1191 2.0891 2.2940 3.7432 3.8917 3.8488 3.9057 3.9013 3.8506 4.1618 3.7145 3.9483 3.9824 3.8912 3.6824 3.9921 3.9317 3.6255 3.8679 3.5726 3.9464 3.9802 3.9173 3.9406 3.9180 1.0071 1.0335 1.0045 1.0221 0.9980 1.0050 1.0050 1.0072 1.0135 1.0001 1.0029 1.0150 1.0158 0.9922 1.0054 0.9931 1.0109 1.0179 1.0156 1.0129 1.0085 1.0164 1.0133 1.0013 1.0013 1.0006
dispcorr: -0.030142487 hartree
energy: -1079.759082901131
dipole: 9.87471 -10.30320 -0.42849 -13.98505 13.95637 -0.02868 -0.71197 0.02456 -0.68741
magnitude: 0.81053 au
magnitude: 2.06020 debye
