program: Orca
programVersion: 5.0.2
elementType: O O O C C C C C C C C C C C C C C C C C C C C C C H H H H H H H H H H H H H H H H H H H H H H H H H H
charge: 0
multiplicity: 1
keywords: wb97x-d3
keywords: def2-TZVPP
keywords: def2/J RIJCOSX
keywords: DEFGRID2
keywords: scfconv7
keywords: smallprint printgap noloewdin
keywords: NOSOSCF
formula: C22H26O3
InChI: InChI=1/C22H26O3/c1-15(2)10-19-20(22(19,3)4)21(23)25-14-17-12-18(24-13-17)11-16-8-6-5-7-9-16/h5-10,12-13,19-20H,11,14H2,1-4H3
51 atoms
O  1.022058 -1.02937 0.191918
O  3.111371 -1.813138 0.101879
O  -2.98544 -2.041185 1.586666
C  3.423642 0.726146 -1.781892
C  4.078132 0.960792 -0.454131
C  2.647762 0.461115 -0.502495
C  2.950631 1.901577 -2.602602
C  3.916715 -0.422343 -2.626371
C  4.342974 2.309878 0.083763
C  2.324737 -0.903259 -0.047377
C  5.480018 2.730771 0.647537
C  5.597499 4.126223 1.183703
C  6.710773 1.892969 0.818929
C  0.546117 -2.3001 0.671886
C  -0.930561 -2.206524 0.762893
C  -1.866699 -2.170316 -0.321348
C  -1.670435 -2.122838 1.891638
C  -3.096761 -2.071514 0.232258
C  -4.459416 -1.956833 -0.345331
C  -5.060413 -0.590805 -0.11465
C  -6.104278 -0.409877 0.785372
C  -4.558638 0.516884 -0.794828
C  -6.643815 0.853304 0.999094
C  -5.09453 1.778303 -0.584135
C  -6.140479 1.950398 0.315297
H  4.799594 0.197547 -0.183174
H  1.878194 1.194372 -0.287631
H  2.524815 2.69941 -1.995823
H  2.184521 1.584718 -3.312553
H  3.777852 2.323664 -3.176678
H  3.109274 -0.838722 -3.23196
H  4.350895 -1.229277 -2.040364
H  4.688903 -0.066304 -3.310966
H  3.520295 3.016683 0.024026
H  6.392502 4.676741 0.67407
H  4.671655 4.690256 1.072834
H  5.861789 4.116536 2.244402
H  6.878846 1.665206 1.875225
H  6.680828 0.94952 0.276952
H  7.593537 2.439944 0.479141
H  0.983634 -2.515597 1.648607
H  0.844495 -3.090444 -0.019072
H  -1.644613 -2.215166 -1.376111
H  -1.40935 -2.118454 2.938514
H  -5.11369 -2.725566 0.073622
H  -4.381825 -2.156482 -1.415364
H  -6.503154 -1.263343 1.320628
H  -3.742379 0.389082 -1.496632
H  -7.458207 0.977993 1.701069
H  -4.697817 2.628652 -1.123727
H  -6.560326 2.934298 0.479174
elementType: O C H
totalener: -1079.74255347 hartree
nucrepener: 2014.56632343 hartree
electener: -3094.30887690 hartree
oneelecener: -5468.21977615 hartree
twoeener: 2373.91089925 hartree
cpcmener: -0.03209480 hartree
kineticenergy: 1074.85090777 hartree
xcener: -106.458925986260 hartree
chargesum: 0.0000000
charge: -0.278618 -0.507607 -0.286716 0.101533 0.053141 -0.098101 -0.268940 -0.276177 -0.291553 0.424658 -0.040665 -0.220391 -0.258455 0.085549 -0.090821 -0.317609 -0.025665 0.193009 -0.052065 0.027176 -0.187653 -0.192289 -0.160322 -0.164311 -0.173838 0.087083 0.089206 0.089938 0.097644 0.097465 0.100202 0.090474 0.097054 0.121185 0.094203 0.088594 0.093263 0.100588 0.092310 0.093888 0.115821 0.113135 0.165477 0.179711 0.109425 0.118147 0.142953 0.146372 0.159799 0.161010 0.161782
qa: -0.2786 -0.5076 -0.2867 0.1015 0.0531 -0.0981 -0.2689 -0.2762 -0.2916 0.4247 -0.0407 -0.2204 -0.2585 0.0855 -0.0908 -0.3176 -0.0257 0.1930 -0.0521 0.0272 -0.1877 -0.1923 -0.1603 -0.1643 -0.1738 0.0871 0.0892 0.0899 0.0976 0.0975 0.1002 0.0905 0.0971 0.1212 0.0942 0.0886 0.0933 0.1006 0.0923 0.0939 0.1158 0.1131 0.1655 0.1797 0.1094 0.1181 0.1430 0.1464 0.1598 0.1610 0.1618
va: 2.1206 1.9943 2.2650 3.6967 3.7485 3.8698 3.9091 3.9038 3.8839 4.1233 3.7443 3.9221 3.9422 3.8408 3.7368 3.9901 3.9439 3.6346 3.8132 3.6049 3.9406 3.9313 3.8902 3.9034 3.8921 1.0356 1.0363 1.0055 1.0018 1.0018 0.9991 1.0183 1.0004 1.0101 0.9964 1.0088 0.9952 0.9954 1.0076 0.9979 0.9993 0.9948 1.0064 0.9936 1.0080 1.0063 1.0034 1.0025 0.9901 0.9902 0.9892
dispcorr: -0.020942968 hartree
energy: -1079.763496436910
dipole: 27.11472 -27.62334 -0.50861 16.99305 -16.33478 0.65827 -7.66155 7.16800 -0.49354
magnitude: 0.96726 au
magnitude: 2.45857 debye
