program: Orca
programVersion: 5.0.2
elementType: O O O C C C C C C C C C C C C C C C C C C C C C C H H H H H H H H H H H H H H H H H H H H H H H H H H
charge: 0
multiplicity: 1
keywords: wb97x-d3
keywords: def2-TZVPP
keywords: def2/J RIJCOSX
keywords: DEFGRID2
keywords: scfconv7
keywords: smallprint printgap noloewdin
keywords: NOSOSCF
formula: C22H26O3
InChI: InChI=1/C22H26O3/c1-15(2)10-19-20(22(19,3)4)21(23)25-14-17-12-18(24-13-17)11-16-8-6-5-7-9-16/h5-10,12-13,19-20H,11,14H2,1-4H3
51 atoms
O  1.555581 -1.944641 -0.522306
O  0.719626 -0.670019 -2.16295
O  -2.161834 -3.171178 1.364723
C  1.36729 1.523624 0.034418
C  2.277376 1.648958 -1.140531
C  2.11604 0.298225 -0.480818
C  1.819348 2.031787 1.381042
C  -0.123936 1.64839 -0.169307
C  3.58851 2.346036 -1.072668
C  1.393424 -0.786419 -1.162679
C  4.644793 2.03639 -1.82924
C  5.932814 2.793763 -1.7296
C  4.636577 0.926302 -2.833835
C  0.714032 -3.054932 -0.887941
C  -0.594107 -2.935644 -0.190987
C  -1.680918 -2.048576 -0.483763
C  -0.947922 -3.588124 0.941229
C  -2.600151 -2.226017 0.493387
C  -3.8843 -1.535155 0.794501
C  -3.641253 -0.120593 1.266304
C  -3.038938 0.118029 2.500469
C  -3.973012 0.96424 0.461843
C  -2.775443 1.41368 2.919394
C  -3.711454 2.264029 0.879858
C  -3.110473 2.492353 2.109006
H  1.763144 1.729813 -2.095196
H  2.928792 -0.031983 0.156384
H  1.618889 3.101099 1.474259
H  2.883788 1.875439 1.554242
H  1.275508 1.524749 2.180168
H  -0.445051 1.39698 -1.178141
H  -0.430167 2.679762 0.017808
H  -0.671036 1.011859 0.530794
H  3.675809 3.172846 -0.373346
H  6.19321 3.252291 -2.686964
H  5.890699 3.581578 -0.977823
H  6.758705 2.125087 -1.474192
H  5.444044 0.217803 -2.632313
H  3.701221 0.369972 -2.856868
H  4.816617 1.317529 -3.838565
H  1.249416 -3.941044 -0.550238
H  0.604915 -3.118159 -1.970817
H  -1.765844 -1.358203 -1.307105
H  -0.458466 -4.347184 1.531345
H  -4.434205 -2.099035 1.550808
H  -4.507196 -1.519508 -0.101306
H  -2.774116 -0.716434 3.139472
H  -4.441312 0.792838 -0.500142
H  -2.309622 1.582715 3.881741
H  -3.97784 3.097366 0.242485
H  -2.905598 3.503363 2.43621
elementType: O C H
totalener: -1079.73781929 hartree
nucrepener: 2179.95222769 hartree
electener: -3259.69004698 hartree
oneelecener: -5799.56848077 hartree
twoeener: 2539.87843378 hartree
cpcmener: -0.02810543 hartree
kineticenergy: 1074.85398253 hartree
xcener: -106.461142820132 hartree
chargesum: 0.0000000
charge: -0.289196 -0.500970 -0.280357 0.213262 -0.033847 -0.114436 -0.297527 -0.304973 -0.297697 0.419250 -0.015337 -0.229689 -0.241533 0.074897 -0.074212 -0.349845 -0.038439 0.237985 -0.033735 -0.011432 -0.171515 -0.169263 -0.161617 -0.161366 -0.178480 0.104015 0.094240 0.100871 0.095265 0.096030 0.100908 0.105012 0.071006 0.125138 0.096076 0.090217 0.095329 0.096642 0.077690 0.101836 0.119579 0.119657 0.162711 0.179809 0.110482 0.105447 0.141262 0.142028 0.159869 0.159174 0.159780
qa: -0.2892 -0.5010 -0.2804 0.2133 -0.0338 -0.1144 -0.2975 -0.3050 -0.2977 0.4193 -0.0153 -0.2297 -0.2415 0.0749 -0.0742 -0.3498 -0.0384 0.2380 -0.0337 -0.0114 -0.1715 -0.1693 -0.1616 -0.1614 -0.1785 0.1040 0.0942 0.1009 0.0953 0.0960 0.1009 0.1050 0.0710 0.1251 0.0961 0.0902 0.0953 0.0966 0.0777 0.1018 0.1196 0.1197 0.1627 0.1798 0.1105 0.1054 0.1413 0.1420 0.1599 0.1592 0.1598
va: 2.1124 1.9918 2.2715 3.6536 3.8422 3.8270 3.9070 3.8894 3.8861 4.1242 3.7077 3.9287 3.9379 3.8395 3.6923 3.9450 3.9584 3.6091 3.7911 3.6660 3.8899 3.8827 3.8704 3.8606 3.8560 1.0249 1.0331 0.9990 1.0024 1.0029 1.0167 1.0005 1.0034 1.0028 0.9956 1.0061 0.9966 0.9991 1.0177 0.9989 0.9972 1.0096 1.0167 0.9923 1.0142 1.0084 1.0102 1.0029 0.9905 0.9910 0.9907
dispcorr: -0.026766659 hartree
energy: -1079.764585950685
dipole: 18.28580 -17.88933 0.39646 17.82923 -17.83992 -0.01069 -3.38460 4.12308 0.73847
magnitude: 0.83824 au
magnitude: 2.13062 debye
