program: Orca
programVersion: 5.0.2
elementType: O O O C C C C C C C C C C C C C C C C C C C C C C H H H H H H H H H H H H H H H H H H H H H H H H H H
charge: 0
multiplicity: 1
keywords: wb97x-d3
keywords: def2-TZVPP
keywords: def2/J RIJCOSX
keywords: DEFGRID2
keywords: scfconv7
keywords: smallprint printgap noloewdin
keywords: NOSOSCF
formula: C22H26O3
InChI: InChI=1/C22H26O3/c1-15(2)10-19-20(22(19,3)4)21(23)25-14-17-12-18(24-13-17)11-16-8-6-5-7-9-16/h5-10,12-13,19-20H,11,14H2,1-4H3
51 atoms
O  1.537705 -1.941914 -0.51355
O  0.720322 -0.66354 -2.160745
O  -2.187149 -3.22185 1.340847
C  1.35213 1.543169 0.016308
C  2.297002 1.642552 -1.13277
C  2.097912 0.300903 -0.461024
C  1.770717 2.060345 1.370568
C  -0.130763 1.686779 -0.231971
C  3.61511 2.321975 -1.038299
C  1.383083 -0.782036 -1.153329
C  4.663487 2.038595 -1.815771
C  5.957755 2.78125 -1.691935
C  4.636387 0.977203 -2.871545
C  0.701951 -3.051986 -0.892403
C  -0.607707 -2.944966 -0.196276
C  -1.682631 -2.034825 -0.460361
C  -0.975196 -3.636203 0.90819
C  -2.608943 -2.238308 0.504836
C  -3.887477 -1.54459 0.823965
C  -3.633938 -0.12711 1.280518
C  -2.992314 0.117843 2.493558
C  -3.99457 0.953618 0.483286
C  -2.718677 1.415443 2.899062
C  -3.722978 2.255708 0.888024
C  -3.082937 2.490277 2.095892
H  1.81149 1.716052 -2.102703
H  2.887802 -0.031503 0.203033
H  1.589582 3.134638 1.443559
H  2.824997 1.884428 1.582649
H  1.189779 1.57537 2.157229
H  -0.70626 1.053759 0.448351
H  -0.424259 1.44415 -1.251183
H  -0.429958 2.720905 -0.049029
H  3.715772 3.112333 -0.29992
H  5.924199 3.540757 -0.911114
H  6.77928 2.097183 -1.464854
H  6.218817 3.273579 -2.63227
H  4.740229 1.421201 -3.86513
H  5.479826 0.292797 -2.752892
H  3.722451 0.385603 -2.866527
H  1.239639 -3.940094 -0.563637
H  0.595073 -3.10376 -1.976082
H  -1.755009 -1.31184 -1.256528
H  -0.497536 -4.42257 1.471556
H  -4.421767 -2.10241 1.595814
H  -4.529643 -1.535433 -0.058436
H  -2.703967 -0.713838 3.126078
H  -4.492619 0.777377 -0.462728
H  -2.221951 1.589128 3.844987
H  -4.011606 3.085928 0.256317
H  -2.869805 3.502993 2.412308
elementType: O C H
totalener: -1079.73776568 hartree
nucrepener: 2178.81993715 hartree
electener: -3258.55770283 hartree
oneelecener: -5797.28338391 hartree
twoeener: 2538.72568108 hartree
cpcmener: -0.02812355 hartree
kineticenergy: 1074.85340485 hartree
xcener: -106.461151618001 hartree
chargesum: 0.0000000
charge: -0.289426 -0.501246 -0.280800 0.215914 -0.042682 -0.105423 -0.299970 -0.299399 -0.293447 0.416493 -0.014153 -0.228610 -0.244587 0.075363 -0.077794 -0.344597 -0.037575 0.234770 -0.031234 -0.014527 -0.169159 -0.165714 -0.164401 -0.164027 -0.176311 0.103621 0.093098 0.101394 0.094657 0.096050 0.064842 0.101859 0.104708 0.125404 0.089897 0.095558 0.095546 0.102803 0.095062 0.078215 0.119560 0.119693 0.163095 0.179564 0.110132 0.105027 0.141791 0.142302 0.159722 0.159260 0.159679
qa: -0.2894 -0.5012 -0.2808 0.2159 -0.0427 -0.1054 -0.3000 -0.2994 -0.2934 0.4165 -0.0142 -0.2286 -0.2446 0.0754 -0.0778 -0.3446 -0.0376 0.2348 -0.0312 -0.0145 -0.1692 -0.1657 -0.1644 -0.1640 -0.1763 0.1036 0.0931 0.1014 0.0947 0.0961 0.0648 0.1019 0.1047 0.1254 0.0899 0.0956 0.0955 0.1028 0.0951 0.0782 0.1196 0.1197 0.1631 0.1796 0.1101 0.1050 0.1418 0.1423 0.1597 0.1593 0.1597
va: 2.1121 1.9913 2.2716 3.6448 3.8495 3.8240 3.9101 3.8877 3.8829 4.1279 3.7060 3.9279 3.9409 3.8383 3.6993 3.9467 3.9560 3.6193 3.7908 3.6733 3.8850 3.8811 3.8672 3.8640 3.8515 1.0245 1.0338 0.9986 1.0026 1.0028 1.0054 1.0175 1.0009 1.0028 1.0063 0.9967 0.9954 0.9982 0.9997 1.0165 0.9973 1.0100 1.0158 0.9924 1.0143 1.0079 1.0093 1.0027 0.9908 0.9909 0.9908
dispcorr: -0.026704326 hartree
energy: -1079.764470010578
dipole: 18.28327 -17.89670 0.38657 18.07544 -18.06626 0.00918 -3.49305 4.23008 0.73703
magnitude: 0.83231 au
magnitude: 2.11555 debye
